program: Gaussian 09
title: 000264975
version: EM64L-G09RevD.01
frameworkgroup: C1[X(C17H21NO2)]
method: RPBEPBE
basis: SDD
operation: Freq
keyword: #p
keyword: freq=noraman
keyword: PBEPBE/SDD
title: #p freq=noraman PBEPBE/SDD
converged: YES YES NO NO
title: Mulliken charges:
elementType: O O N C C C C C C C C C C C C C C C C C H H H H H H H H H H H H H H H H H H H H H
charge: -0.476212 -0.268014 -0.100491 0.304504 0.358188 -0.406365 -0.565504 0.434694 -0.543344 -0.435793 0.326695 -0.380052 -0.434162 -0.366504 -0.624114 -0.623025 -0.231251 -0.222487 -0.245756 -0.537089 0.275667 0.243146 0.199900 0.311602 0.235758 0.248018 0.243181 0.254767 0.254339 0.186300 0.218058 0.223160 0.191952 0.230956 0.348291 0.228402 0.226329 0.228712 0.226463 0.220609 0.240472
chargesum: 0.00000
title: Mulliken charges with hydrogens summed into heavy atoms:
elementType: O O N C C C C C C C C C C C C C C C C C
charge: -0.127921 -0.268014 -0.100491 0.304504 0.358188 -0.130698 -0.122458 0.434694 -0.231742 -0.200035 0.326695 -0.132034 -0.190981 -0.111737 0.034583 0.023044 -0.002849 0.003843 -0.017045 0.150455
polarizability: 2.50400015e+02 1.13242884e+01 1.89969152e+02 7.21262320e-01 4.73830464e-01 1.49112921e+02
1716.lowfreq: -2.8734 -0.0003 0.0002 0.0004 5.2470 11.0888 25.0848 38.9723 47.3505
frequency: 24.9531 38.9027 47.3497 58.8586 67.2489 88.6438 107.9339 142.4102 155.8399 172.2284 199.5076 216.7022 236.7473 239.9605 257.3025 273.6791 278.9123 301.2320 322.1168 335.8386 349.7802 363.0946 404.6978 425.2114 436.7547 453.7896 500.5250 533.2598 539.5233 592.4052 593.8022 617.9548 659.6457 706.7251 722.2435 730.2643 774.8920 802.9105 820.2396 820.8750 840.1485 859.2745 910.7295 919.8375 930.6769 949.5919 956.3152 973.2413 981.4501 990.4560 998.0876 1001.8788 1016.4079 1025.1544 1033.9121 1079.7982 1086.6636 1091.9912 1113.2613 1134.2282 1149.7166 1156.9969 1169.2681 1171.6988 1179.3100 1185.4898 1201.5760 1214.1335 1236.5010 1254.0743 1270.3287 1278.6089 1293.2382 1335.7224 1353.1822 1365.5481 1385.7442 1390.8095 1414.9824 1417.2755 1440.2478 1443.0406 1443.9299 1460.3884 1464.2407 1465.0128 1472.7187 1475.7332 1476.9496 1479.6719 1487.1763 1492.5123 1587.9960 1591.8458 1608.6345 1616.3057 2843.5019 2851.2157 2866.7926 2960.5706 2983.1885 2999.7220 3014.4641 3029.2161 3048.1029 3074.0762 3091.2311 3115.3582 3120.0629 3121.6213 3125.0205 3136.6380 3147.5116 3162.5597 3167.1669 3181.5848 3571.4749
redmass: 4.6973 3.5910 3.7663 4.6807 3.0700 2.9333 3.7587 4.3673 4.1469 3.4688 2.1245 2.1883 1.3708 1.2433 1.7481 1.9272 1.7882 2.4874 2.8892 3.3737 3.2091 2.5580 2.8458 2.6549 3.9330 3.3606 3.7826 3.9151 4.7873 4.0071 4.7515 6.2217 5.5237 1.7970 4.8147 3.7793 2.0618 2.8481 2.7192 3.9823 2.2096 1.2471 1.6285 2.4373 1.8585 1.5032 4.1960 1.8449 1.3804 6.2911 1.3121 3.8342 2.5591 2.2106 1.5388 1.6319 1.9113 1.2882 1.2607 1.3965 1.3338 1.3486 1.9384 1.0789 1.7263 1.1343 2.1290 2.1672 1.9382 2.5660 1.8596 1.3874 1.3460 1.2921 1.7020 1.5854 4.4860 4.0551 2.5685 1.1733 1.2035 1.3489 2.0335 1.0473 1.0834 1.0497 1.1347 1.0779 1.0795 2.0803 1.0679 2.3984 7.8512 6.0031 6.0322 6.6973 1.0694 1.0571 1.0576 1.0327 1.0851 1.0860 1.0722 1.0734 1.1037 1.1011 1.1003 1.0865 1.0893 1.0998 1.0864 1.0916 1.0957 1.1013 1.0950 1.0897 1.0662
irintensity: 0.1095 0.3902 1.0450 0.4768 1.7404 1.6896 2.0177 1.4868 2.1968 2.4277 0.7962 1.1429 0.6214 0.6761 11.5617 58.1731 23.2360 36.6571 29.9175 11.5700 1.5105 13.6782 0.2708 0.1765 2.0666 1.0436 6.8809 3.3712 12.6081 20.5289 17.2107 1.1083 1.3882 51.6676 30.7326 13.2464 31.6214 21.7431 1.4628 16.9352 51.7448 0.1737 21.3559 7.6130 10.6158 3.7326 49.5086 3.2056 0.2416 0.6503 0.3343 79.8993 30.5528 8.1967 14.3640 6.1834 63.8898 3.3487 0.2466 30.2279 45.8854 1.1971 4.7415 0.3198 4.7749 1.4754 9.5166 59.2848 26.2133 16.3363 44.0976 7.2903 39.4086 9.3334 1.1906 62.2564 2.0832 12.6369 14.9906 2.4777 2.7050 14.1747 10.0526 12.0239 7.4176 11.9313 91.2725 9.3286 12.1897 12.5909 8.9080 51.4806 9.3251 1.5257 6.2412 105.0045 42.3561 68.0674 262.1501 62.3586 3.0735 18.6501 37.7450 35.5826 46.3462 36.4307 28.7758 5.9156 16.4149 31.5006 0.1728 17.2696 30.5800 26.1955 10.0421 5.1064 8.1624
temp: 298.150 k
press: 1.00000 atm
elementType: 8 8 7 6 6 6 6 6 6 6 6 6 6 6 6 6 6 6 6 6 1 1 1 1 1 1 1 1 1 1 1 1 1 1 1 1 1 1 1 1 1
symmnumber: 1
zpe: 893309.9 jmol-1
zpe.correction: 0.340244 hartree
zpe.thermalcorrener: 0.360142 hartree
zpe.thermalcorrenthalpy: 0.361086 hartree
zpe.thermalcorrgfe: 0.291287 hartree
zpe.sumelectzpe: -864.084147 hartree
zpe.sumelectthermal: -864.064249 hartree
zpe.sumelectthermalent: -864.063304 hartree
zpe.sumelectthermalfe: -864.133104 hartree
dipole: 2.3059 -0.2612 0.3872
dipole: 2.3527
quadrupole: -111.9000 -108.3207 -118.4638
quadrupole: 5.0681 -1.9835 -1.3043
quadrupole: 0.9949 4.5741 -5.5690 5.0681 -1.9835 -1.3043
hfenergy: -864.4243907 hartree
pointgroup: C01 [X(C17H21N1O2)]
dipole: -0.3907202 0.8368657 -0.0614324 debye
polarizability: 189.4463902|-10.9603745|248.829209|1.7748837|13.5130603|151.2064882 unknown
InChI: InChI=1S/C17H21NO2/c1-18(2)12-14-9-10-15(20-3)11-16(14)17(19)13-7-5-4-6-8-13/h4-11,17,19H,12H2,1-3H3
charge 0 multiplicity 1
41 atoms
O  -0.813385 -0.176839 -2.399574
O  0.811921 -4.392458 -0.338433
N  2.179476 2.00508 0.110142
C  0.465591 -0.639111 -0.386497
C  1.325186 -0.301964 0.699712
C  -0.271462 0.450482 -1.164933
C  1.565099 1.132806 1.152774
C  -1.413045 1.10362 -0.378989
C  0.280398 -1.992452 -0.754453
C  1.962273 -1.358887 1.399757
C  0.933255 -3.024201 -0.040602
C  1.776728 -2.708901 1.04997
C  -1.533251 2.515631 -0.3541
C  -2.395546 0.317323 0.276218
C  3.503449 1.521618 -0.33414
C  2.226886 3.41356 0.553607
C  -2.617711 3.135944 0.30867
C  -3.478283 0.933509 0.939195
C  -3.593556 2.345127 0.957114
C  -0.029544 -4.76044 -1.479346
H  0.460126 1.239093 -1.431512
H  0.605753 1.607193 1.438313
H  2.200054 1.109788 2.075699
H  -0.363294 -2.197187 -1.612302
H  2.626312 -1.112277 2.237125
H  2.273449 -3.519139 1.591903
H  -0.77107 3.125489 -0.856177
H  -2.300374 -0.774168 0.264602
H  3.417263 0.489388 -0.712101
H  4.266728 1.528026 0.485502
H  3.874315 2.16235 -1.154246
H  2.611397 4.049854 -0.263815
H  2.881657 3.571857 1.448516
H  1.209267 3.757661 0.813128
H  -1.399792 0.486047 -2.843547
H  -2.700197 4.228731 0.320303
H  -4.231722 0.318055 1.44405
H  -4.434642 2.821705 1.473386
H  0.347194 -4.312188 -2.419013
H  -1.081282 -4.451064 -1.322078
H  0.030179 -5.857363 -1.538928
