program: Gaussian 09
title: 000264970
version: EM64L-G09RevD.01
frameworkgroup: C1[X(C16H18ClNO)]
method: RPBEPBE
basis: SDD
operation: Freq
keyword: #p
keyword: freq=noraman
keyword: PBEPBE/SDD
title: #p freq=noraman PBEPBE/SDD
converged: YES YES NO NO
title: Mulliken charges:
elementType: Cl O N C C C C C C C C C C C C C C C C H H H H H H H H H H H H H H H H H H
charge: -0.062465 -0.437798 -0.102233 0.247661 0.363203 -0.334009 -0.550361 0.370304 -0.320374 -0.429587 -0.140362 -0.244136 -0.371055 -0.437238 -0.619139 -0.614899 -0.235389 -0.222909 -0.246628 0.297151 0.257222 0.202317 0.292958 0.245666 0.256685 0.246833 0.261759 0.243936 0.188073 0.225098 0.225525 0.192083 0.237354 0.335631 0.226301 0.224794 0.228025
chargesum: 0.00000
title: Mulliken charges with hydrogens summed into heavy atoms:
elementType: Cl O N C C C C C C C C C C C C C C C C
charge: -0.062465 -0.102167 -0.102233 0.247661 0.363203 -0.036858 -0.090822 0.370304 -0.027415 -0.183921 -0.140362 0.012549 -0.124222 -0.175478 0.037969 0.040062 -0.009087 0.001884 -0.018603
polarizability: 2.27800855e+02 -3.02009147e+00 1.98304804e+02 1.04049832e+00 1.38305280e+01 1.44308643e+02
1716.lowfreq: -6.6507 -4.3943 -0.0005 -0.0005 0.0007 7.7105 26.9773 32.3969 47.9155
frequency: 26.8633 32.3758 47.9120 56.9927 67.9472 73.8448 117.6542 154.0630 172.4530 199.7959 220.6005 236.8821 244.5725 276.3785 287.6176 292.9920 338.6878 347.8107 369.5066 405.4858 408.1087 415.6631 422.6754 444.1884 460.1327 501.1666 573.1085 611.6274 616.3856 640.3855 660.1347 707.2485 726.4023 745.9918 800.9442 817.4504 819.2836 842.2894 860.9794 883.1774 908.3667 931.9214 939.8472 954.3865 978.7685 983.4317 989.9984 998.6896 1018.7943 1028.2911 1035.5520 1079.4429 1081.3956 1088.2042 1102.0802 1136.3589 1167.2759 1171.2562 1171.8159 1186.4229 1199.8149 1205.5404 1234.8291 1250.7734 1257.9456 1274.3745 1305.7172 1314.0056 1363.0608 1375.4210 1377.8635 1393.4131 1398.8214 1417.5436 1434.8974 1442.4893 1461.6281 1466.1855 1470.3702 1476.1227 1479.6968 1481.9150 1488.1614 1575.1593 1590.6927 1598.8696 1613.4668 2852.0545 2856.6976 2873.1552 3001.9905 3022.7787 3024.0339 3030.4513 3082.1673 3089.0766 3119.7438 3126.6267 3127.3625 3140.2695 3152.5644 3158.6805 3164.6839 3170.4581 3526.4798
redmass: 4.2949 3.9489 4.5008 3.3911 4.6548 4.3181 5.0467 4.7759 5.6540 3.6107 2.2047 1.1839 1.6348 4.9613 4.0801 3.0696 2.7139 2.4827 1.4589 3.2789 2.7192 3.6774 3.0275 3.2909 3.6393 3.5428 4.5970 5.9711 6.3824 4.2028 6.0155 2.1702 3.0490 2.2837 2.3500 3.4887 3.2981 1.9559 1.2528 3.9692 1.5298 1.5460 4.5141 1.4081 1.7255 1.5925 3.5256 1.3435 2.3850 2.1542 1.5551 2.1175 1.5951 1.2546 2.1539 1.4598 1.9937 1.2838 1.2918 1.1340 1.7773 1.7305 2.3314 1.7901 1.9543 1.5935 1.3795 1.3571 1.5293 3.2996 4.5159 2.2806 1.6957 1.1429 2.1665 1.1816 1.0479 1.1385 2.0697 1.0541 1.2426 1.8886 1.0689 7.5339 6.2320 7.0243 6.0630 1.0692 1.0567 1.0577 1.0847 1.0849 1.0755 1.0732 1.1015 1.1011 1.0852 1.0898 1.0875 1.0928 1.0948 1.0918 1.1008 1.0955 1.0661
irintensity: 0.9065 0.6290 0.0833 0.3336 0.4236 0.2298 0.1874 0.3722 0.4928 0.9882 2.0104 0.2883 0.5883 0.6846 0.4295 1.9552 21.6699 16.2896 136.0125 2.8238 11.8622 7.3293 1.8500 11.2299 14.5093 8.9927 8.8015 19.4179 1.8860 15.2993 27.8633 40.8809 20.9737 26.0637 36.2613 14.3582 39.0132 38.5062 1.0327 35.9382 13.8715 10.7957 41.4600 4.3706 11.8996 0.4603 0.3193 0.4881 58.5480 5.8662 10.3132 14.0865 2.1379 4.7086 10.5113 9.2903 17.3566 0.8202 3.0862 3.2458 18.2705 29.5170 26.6439 17.1569 4.7597 12.0155 10.6807 0.8512 12.8240 3.7570 1.3031 0.4771 14.2747 4.8870 13.7827 4.1009 10.0715 10.8771 54.4363 14.9764 1.0655 21.2555 18.8671 21.0709 0.4495 18.7082 7.9544 47.6922 65.0379 304.4800 46.5653 15.4792 23.4714 32.8347 20.6654 38.8980 5.5054 13.1785 2.6916 27.4180 23.5889 0.1861 23.4688 4.7402 5.6611
temp: 298.150 k
press: 1.00000 atm
elementType: 17 8 7 6 6 6 6 6 6 6 6 6 6 6 6 6 6 6 6 1 1 1 1 1 1 1 1 1 1 1 1 1 1 1 1 1 1
symmnumber: 1
zpe: 785636.3 jmol-1
zpe.correction: 0.299233 hartree
zpe.thermalcorrener: 0.317760 hartree
zpe.thermalcorrenthalpy: 0.318704 hartree
zpe.thermalcorrgfe: 0.251088 hartree
zpe.sumelectzpe: -1209.121729 hartree
zpe.sumelectthermal: -1209.103202 hartree
zpe.sumelectthermalent: -1209.102258 hartree
zpe.sumelectthermalfe: -1209.169874 hartree
dipole: 1.6695 -1.2829 0.5656
dipole: 2.1801
quadrupole: -104.2963 -127.8722 -116.6555
quadrupole: -2.5314 1.5872 -2.5831
quadrupole: 11.9784 -11.5976 -0.3808 -2.5314 1.5872 -2.5831
hfenergy: -1209.4209619 hartree
pointgroup: C01 [X(C16H18Cl1N1O1)]
dipole: 0.5617905 0.6464715 -0.0466313 debye
polarizability: 225.9485132|8.1834742|189.2481961|-0.5504533|25.9935326|155.2175915 unknown
InChI: InChI=1S/C16H18ClNO/c1-18(2)11-13-8-9-14(17)10-15(13)16(19)12-6-4-3-5-7-12/h3-10,16,19H,11H2,1-2H3
charge 0 multiplicity 1
37 atoms
Cl 1.095267 -4.18123 -1.411276
O  -0.466764 0.331055 2.24354
N  1.849824 2.540926 0.11415
C  0.678834 -0.414398 0.201868
C  2.030707 0.03894 0.295853
C  -0.451407 0.459779 0.760853
C  2.370232 1.39383 0.907166
C  -1.832942 0.232871 0.14401
C  0.407075 -1.70256 -0.321643
C  3.069788 -0.813071 -0.145022
C  1.469788 -2.521878 -0.743484
C  2.808177 -2.10048 -0.669184
C  -1.995565 0.243585 -1.266864
C  -2.979817 0.082995 0.960444
C  2.496055 2.665391 -1.208388
C  1.897066 3.803612 0.882208
C  -3.273808 0.093789 -1.845824
C  -4.260553 -0.07524 0.381195
C  -4.413351 -0.072495 -1.023224
H  -0.158012 1.514267 0.603962
H  1.910328 1.455553 1.911558
H  3.479317 1.462263 1.045115
H  -0.625269 -2.055242 -0.40452
H  4.108397 -0.468392 -0.07673
H  3.620455 -2.750267 -1.007043
H  -1.118375 0.370518 -1.912656
H  -2.864681 0.115853 2.048664
H  2.386008 1.722638 -1.770648
H  3.588189 2.902393 -1.137906
H  2.006546 3.470573 -1.784375
H  1.438063 4.614472 0.289237
H  2.937071 4.118595 1.149617
H  1.320209 3.692252 1.817498
H  -0.56929 -0.630541 2.469426
H  -3.381445 0.104562 -2.936439
H  -5.137856 -0.192218 1.027747
H  -5.405665 -0.192901 -1.472183
