program: Gaussian 09
title: 000264965
version: EM64L-G09RevD.01
frameworkgroup: C1[X(C15H13N)]
method: RPBEPBE
basis: SDD
operation: Freq
keyword: #pfreq=noraman
keyword: PBEPBE/SDD
title: #p freq=noraman PBEPBE/SDD
converged: NO YES NO NO
title: Mulliken charges:
elementType: N C C C C C C C C C C C C C C C H H H H H H H H H H H H H
charge: -0.023632 -0.586880 -0.582531 0.526617 0.514498 -0.389566 -0.389847 -0.405098 -0.405311 -0.370427 -0.370353 -0.226728 -0.226672 0.388846 -0.241164 -0.255976 0.229704 0.229682 0.225382 0.225373 0.241265 0.241288 0.230317 0.230348 0.255262 0.255263 0.225418 0.225421 0.229501
chargesum: 0.00000
title: Mulliken charges with hydrogens summed into heavy atoms:
elementType: N C C C C C C C C C C C C C C C
charge: -0.023632 -0.127494 -0.131775 0.526617 0.514498 -0.148301 -0.148559 -0.174781 -0.174963 -0.115165 -0.115090 -0.001310 -0.001251 0.388846 -0.011663 -0.255976
polarizability: 2.70891678e+02 -2.12055533e-03 1.52860191e+02 -2.09547209e+01 -2.50292129e-03 7.80371787e+01
1716.lowfreq: -9.2800 -0.0003 0.0007 0.0009 4.8360 15.4380 20.8086 27.7112 40.1417
frequency: 20.6901 27.6931 40.1413 44.0516 92.5018 140.7747 149.8629 236.9866 295.9930 310.7695 363.4870 401.5029 403.7228 418.8175 463.9800 508.4532 545.7625 561.0402 581.6649 617.3690 643.0634 696.6566 707.4979 742.9769 760.5904 788.8793 801.3538 829.5786 853.5389 854.5247 869.1437 917.9569 970.3637 975.9702 982.9646 987.4929 990.1944 993.5944 1000.3801 1013.1270 1026.3539 1075.0869 1113.4921 1147.2076 1172.7147 1187.0156 1189.0254 1204.8039 1217.2256 1222.0230 1267.5012 1269.8778 1312.5805 1322.2690 1327.5333 1369.0714 1382.4908 1411.5482 1440.4995 1474.5633 1483.6882 1489.0127 1498.5208 1565.9822 1593.5484 1613.8796 1618.0176 2174.0270 2988.9654 2998.8799 3038.4983 3065.4641 3113.0322 3113.8098 3128.1977 3130.2047 3131.9570 3144.1963 3160.3892 3163.1348 3164.4804
redmass: 3.9698 4.4051 6.7464 3.0341 5.5454 7.0267 6.2543 5.2706 4.7404 2.1546 2.7190 2.8539 2.8168 5.9834 5.6370 3.5892 7.4901 3.9081 3.7027 6.3650 7.0560 3.8776 1.7303 4.2372 2.0259 1.1879 5.1448 2.2273 1.2473 1.2468 2.2146 1.5191 1.4563 1.3932 1.4227 1.6073 6.2146 1.4735 2.9887 2.9709 2.1931 1.5333 1.3594 1.1279 1.0516 1.1160 1.5058 2.2103 2.4869 2.3694 1.2322 1.4298 1.3048 1.3831 1.2569 4.3078 8.0664 3.2122 2.1740 1.1576 2.1580 1.1017 2.5396 6.6650 6.0607 6.1863 6.2704 12.6301 1.0591 1.0596 1.1016 1.1050 1.0884 1.0866 1.0890 1.0892 1.0901 1.0955 1.0957 1.1014 1.0971
irintensity: 0.3353 0.7783 1.1696 0.2129 1.2098 0.9510 2.9040 0.0739 2.1855 0.0008 0.3574 0.0000 0.0002 0.9384 0.6049 16.8412 0.1913 25.0351 10.4756 0.0445 0.0001 6.0670 49.3071 1.8212 30.1222 0.3289 2.5364 44.2336 0.0004 0.0004 30.8103 2.9534 1.3626 0.0077 0.0610 0.0434 0.3166 0.3938 1.0283 7.4979 6.7620 11.3595 0.4586 10.3460 0.1392 0.1250 5.2143 0.4519 0.0953 0.3680 0.0339 13.2673 0.1926 1.1422 0.1098 0.0167 0.0103 6.3945 6.4029 1.9332 18.9075 12.8904 28.3939 0.0301 1.7785 16.9739 35.3785 54.0045 3.2584 52.2780 0.4275 23.8227 6.4501 15.3548 7.3116 15.8434 6.8043 41.8142 12.8537 26.9149 0.0757
temp: 298.150 k
press: 1.00000 atm
elementType: 7 6 6 6 6 6 6 6 6 6 6 6 6 6 6 6 1 1 1 1 1 1 1 1 1 1 1 1 1
symmnumber: 1
zpe: 610788.6 jmol-1
zpe.correction: 0.232637 hartree
zpe.thermalcorrener: 0.246412 hartree
zpe.thermalcorrenthalpy: 0.247357 hartree
zpe.thermalcorrgfe: 0.188957 hartree
zpe.sumelectzpe: -633.033582 hartree
zpe.sumelectthermal: -633.019807 hartree
zpe.sumelectthermalent: -633.018863 hartree
zpe.sumelectthermalfe: -633.077263 hartree
dipole: -5.1977 0.0000 0.8248
dipole: 5.2627
quadrupole: -131.0594 -80.7818 -99.7128
quadrupole: 0.0001 1.9986 0.0015
quadrupole: -27.2081 23.0695 4.1386 0.0001 1.9986 0.0015
hfenergy: -633.2662191 hartree
pointgroup: C01 [X(C15H13N1)]
dipole: 2.0434996 -0.0019359 0.3333853 debye
polarizability: 270.7055119|-0.1017576|152.8586212|21.7929151|-0.3799047|78.2249145 unknown
InChI: InChI=1S/C15H13N/c16-12-15-10-8-14(9-11-15)7-6-13-4-2-1-3-5-13/h1-5,8-11H,6-7H2
charge 0 multiplicity 1
29 atoms
N  -6.468079 0.013207 -0.519879
C  0.429997 0.007314 0.721157
C  1.235791 0.000019 -0.62169
C  -1.069983 0.008752 0.486745
C  2.737859 -0.001639 -0.38278
C  -1.784243 1.227911 0.345012
C  -1.788912 -1.209269 0.359823
C  3.45365 1.2164 -0.251569
C  3.449809 -1.221073 -0.243974
C  -3.167742 1.238522 0.084711
C  -3.172462 -1.217736 0.099636
C  4.841889 1.218118 0.012284
C  4.838045 -1.22551 0.019947
C  -3.875475 0.010926 -0.041645
C  5.539307 -0.004381 0.150429
C  -5.290733 0.012063 -0.304311
H  0.730815 0.898669 1.303057
H  0.727838 -0.879852 1.310909
H  0.938957 0.887188 -1.212791
H  0.935796 -0.891228 -1.204999
H  -1.249117 2.179558 0.447096
H  -1.257413 -2.161632 0.473473
H  2.920813 2.169257 -0.365641
H  2.913973 -2.172942 -0.352042
H  -3.708117 2.184898 -0.018094
H  -3.716463 -2.163215 0.008365
H  5.379385 2.168703 0.104966
H  5.372528 -2.177189 0.118647
H  6.616287 -0.005443 0.352157
