program: Gaussian 09
title: 000264963
version: EM64L-G09RevD.01
frameworkgroup: C1[X(C15H12ClN)]
method: RPBEPBE
basis: SDD
operation: Freq
keyword: #p
keyword: freq=noraman
keyword: PBEPBE/SDD
title: #p freq=noraman PBEPBE/SDD
converged: YES YES NO YES
title: Mulliken charges:
elementType: Cl N C C C C C C C C C C C C C C C H H H H H H H H H H H H
charge: -0.057953 -0.021212 -0.585402 -0.587565 0.526273 0.531233 -0.389149 -0.389295 -0.393576 -0.393647 -0.369730 -0.369695 -0.212010 -0.211990 0.389038 -0.107252 -0.255391 0.230131 0.230122 0.228818 0.228815 0.241100 0.241112 0.237563 0.237575 0.256143 0.256145 0.254898 0.254899
chargesum: 0.00000
title: Mulliken charges with hydrogens summed into heavy atoms:
elementType: Cl N C C C C C C C C C C C C C C C
charge: -0.057953 -0.021212 -0.125149 -0.129932 0.526273 0.531233 -0.148049 -0.148182 -0.156013 -0.156072 -0.113587 -0.113550 0.042888 0.042909 0.389038 -0.107252 -0.255391
polarizability: 3.05339374e+02 1.50884684e-03 1.54509233e+02 2.13693002e+01 -2.33007231e-03 8.02031333e+01
1716.lowfreq: -5.8022 -0.0024 -0.0004 0.0010 1.9897 11.6599 19.1550 23.6352 30.7038
frequency: 19.1356 23.5854 30.7037 39.5745 66.4734 133.6861 147.8591 152.9059 235.6798 263.8119 324.9553 336.8579 374.3002 374.4443 401.5846 408.8181 428.9298 482.4090 516.1073 545.0858 568.5399 627.1240 631.7897 642.9641 693.4132 725.2384 745.4678 787.8807 799.1576 810.9736 830.9814 843.7843 854.7369 871.1013 948.1961 965.8734 970.6947 983.4718 989.8397 997.8417 1001.0470 1013.1571 1072.3847 1091.9024 1119.3397 1147.8026 1183.5890 1189.2210 1204.6816 1215.6778 1221.4370 1265.4324 1268.9427 1298.3676 1312.9710 1321.2398 1368.8699 1376.2772 1395.3438 1411.0170 1474.2813 1479.0529 1489.3608 1498.7548 1566.3540 1587.0205 1600.5457 1617.8426 2177.6071 2989.9125 2998.9946 3038.7588 3065.3111 3126.1992 3128.5239 3128.6824 3130.5439 3160.8300 3164.8811 3169.2181 3172.2069
redmass: 4.3773 5.0806 9.5943 3.4136 9.1329 7.9901 6.1611 6.7641 4.2815 6.8783 2.5065 5.4854 2.8059 9.9215 2.8523 2.8888 5.4375 6.4618 3.0761 7.4701 3.1357 6.9085 5.5049 7.0491 4.1538 3.6326 4.3620 1.1884 3.5996 2.4016 1.2463 1.7147 1.2466 2.4449 1.4012 1.3722 1.4473 1.3961 1.6321 3.9117 4.1426 2.9726 2.7606 1.3914 1.3186 1.1201 1.1246 1.5163 2.1952 2.5591 2.3509 1.2300 1.4353 1.2702 1.3029 1.3852 4.3643 7.2861 2.6512 3.1753 1.3782 1.7333 1.0998 2.5364 6.6683 7.3300 6.3252 6.2737 12.6311 1.0592 1.0597 1.1015 1.1049 1.0899 1.0891 1.0899 1.0892 1.0957 1.0971 1.0948 1.0958
irintensity: 0.7605 1.3608 1.9577 0.0715 0.5242 0.9827 2.7521 0.1746 0.2287 0.9292 0.0049 0.8531 0.4110 8.2823 0.0000 0.0002 0.0510 4.3268 30.4003 0.2062 33.4252 0.1397 14.7139 0.0028 0.3123 4.7929 1.2306 0.4317 7.5188 6.8602 0.0015 106.9606 0.0001 12.1193 0.3731 0.0217 1.3765 0.0151 0.0098 11.7961 33.0099 5.8979 43.2063 9.9523 0.0171 12.5563 0.1642 4.5068 0.4139 0.2697 0.5231 0.0399 13.4677 0.1486 0.1517 1.3106 0.0214 0.0535 4.0766 6.0364 31.3001 64.4747 12.8319 28.5370 0.0306 0.5744 3.4701 38.3058 51.2979 0.5530 54.3984 0.0767 23.2680 10.2602 8.9122 15.0643 13.8934 12.0363 0.1869 6.9399 0.4853
temp: 298.150 k
press: 1.00000 atm
elementType: 17 7 6 6 6 6 6 6 6 6 6 6 6 6 6 6 6 1 1 1 1 1 1 1 1 1 1 1 1
symmnumber: 1
zpe: 585210.5 jmol-1
zpe.correction: 0.222895 hartree
zpe.thermalcorrener: 0.237990 hartree
zpe.thermalcorrenthalpy: 0.238934 hartree
zpe.thermalcorrgfe: 0.176805 hartree
zpe.sumelectzpe: -1092.423684 hartree
zpe.sumelectthermal: -1092.408589 hartree
zpe.sumelectthermalent: -1092.407645 hartree
zpe.sumelectthermalfe: -1092.469774 hartree
dipole: -2.8517 0.0001 -0.3921
dipole: 2.8786
quadrupole: -171.7946 -91.0241 -111.1349
quadrupole: -0.0011 -3.9694 -0.0008
quadrupole: -47.1434 33.6271 13.5163 -0.0011 -3.9694 -0.0008
hfenergy: -1092.6465791 hartree
pointgroup: C01 [X(C15H12Cl1N1)]
dipole: 1.1198253 -0.0000271 -0.1690489 debye
polarizability: 304.7361654|0.0001745|154.5091069|-24.3328329|-0.0989363|80.8064678 unknown
InChI: InChI=1S/C15H12ClN/c16-15-9-7-13(8-10-15)2-1-12-3-5-14(11-17)6-4-12/h3-10H,1-2H2
charge 0 multiplicity 1
29 atoms
Cl 6.889375 -0.003027 -0.369016
N  -6.897389 -0.004876 0.472883
C  0.01222 -0.004953 -0.697583
C  0.803063 -0.003348 0.654539
C  -1.490331 -0.004982 -0.478402
C  2.307268 -0.003236 0.434945
C  -2.207258 -1.223862 -0.34947
C  -2.208005 1.21393 -0.354123
C  3.024613 -1.220836 0.310223
C  3.02423 1.214429 0.308703
C  -3.593677 -1.233118 -0.103974
C  -3.594437 1.223273 -0.108651
C  4.416273 -1.232969 0.065274
C  4.415889 1.226691 0.063727
C  -4.300566 -0.004895 0.019894
C  5.090731 -0.003107 -0.05606
C  -5.718876 -0.004877 0.26705
H  0.317622 -0.894419 -1.280178
H  0.317288 0.883365 -1.28209
H  0.497781 -0.891242 1.23993
H  0.497377 0.885651 1.238035
H  -1.6729 -2.176071 -0.450118
H  -1.674228 2.166073 -0.458391
H  2.495215 -2.175913 0.412923
H  2.494529 2.169465 0.410194
H  -4.136549 -2.179101 -0.011348
H  -4.137884 2.169271 -0.019629
H  4.963457 -2.175879 -0.023924
H  4.962771 2.169662 -0.026664
