program: Gaussian 09
title: 000265010
version: EM64L-G09RevD.01
frameworkgroup: C1[X(C12H18N2O8S2)]
method: RPBEPBE
basis: SDD
operation: Freq
keyword: #p
keyword: freq=noraman
keyword: PBEPBE/SDD
title: #p freq=noraman PBEPBE/SDD
converged: YES YES NO NO
title: Mulliken charges:
elementType: S S O O O O O O O O N N C C C C C C C C C C C C H H H H H H H H H H H H H H H H H H
charge: 1.065770 1.066943 -0.399466 -0.401047 -0.499477 -0.570921 -0.496977 -0.572665 -0.205187 -0.215972 -0.166396 0.018488 -0.431574 -0.436637 0.497959 -0.295411 -0.294910 -0.508647 -0.379777 0.388429 -0.188802 -0.405768 -0.753036 -0.754201 0.225173 0.297209 0.234970 0.294884 0.236879 0.260266 0.241496 0.263990 0.282799 0.232262 0.232942 0.286596 0.356584 0.278335 0.291162 0.354201 0.278332 0.291200
chargesum: 0.00000
title: Mulliken charges with hydrogens summed into heavy atoms:
elementType: S S O O O O O O O O N N C C C C C C C C C C C C
charge: 1.065770 1.066943 -0.399466 -0.401047 -0.499477 -0.570921 -0.496977 -0.572665 -0.205187 -0.215972 -0.166396 0.018488 0.090808 0.093217 0.497959 0.201735 0.210577 -0.225848 -0.147515 0.388429 0.044140 -0.119172 0.173045 0.169532
polarizability: 3.27913568e+02 -3.72804429e+00 2.33884985e+02 -1.18225044e+00 2.19097404e+01 1.59679006e+02
1716.lowfreq: -7.2347 0.0009 0.0015 0.0021 3.5337 7.9242 19.1988 26.4641 37.3872
frequency: 19.0898 26.2185 37.3125 50.1643 57.3952 62.4222 66.0265 72.5028 82.7812 91.3474 94.9329 122.8877 135.2755 159.9057 172.9750 176.4013 187.3333 196.4131 210.8128 214.4794 225.9346 233.4932 259.3186 271.2264 298.5643 307.3389 335.8240 339.2969 341.8117 362.4819 379.1214 394.6651 408.9341 430.4251 453.6443 468.3592 482.3649 491.8533 511.5636 526.2871 541.7366 555.5174 596.4032 599.6548 649.6644 674.7498 705.1889 711.7521 786.8394 792.2685 822.4813 833.5317 838.6216 840.8120 873.6000 903.1227 905.1475 915.0650 919.8396 921.5782 974.4331 978.4729 980.5960 990.3387 1006.6687 1012.4106 1034.2991 1050.6793 1057.3323 1064.5239 1079.3268 1091.5033 1094.1901 1182.6430 1188.6815 1210.4821 1214.9628 1218.7315 1254.2135 1277.0412 1303.0411 1325.3064 1327.0942 1336.1661 1338.1984 1360.6765 1367.5825 1371.5444 1383.4216 1398.2864 1412.5596 1416.2798 1432.6245 1436.0975 1436.2384 1437.8770 1452.3886 1478.1985 1486.9989 1507.0111 1568.8016 1627.3171 2979.8303 2984.1706 3007.6359 3010.1774 3012.7387 3016.3372 3063.1636 3066.5501 3080.0153 3083.1238 3143.8188 3156.1735 3157.6688 3169.3176 3188.0432 3189.1981 3189.4372 3199.0006
redmass: 7.0972 5.5467 6.9768 8.0506 9.0307 9.5463 6.2286 8.3587 6.0570 7.3981 8.4208 7.5822 5.4113 3.6911 3.0951 4.1928 3.3440 1.2097 1.5504 2.3394 4.5807 3.1618 4.5997 4.7423 6.4804 6.2142 6.3240 9.1792 10.9024 3.9965 4.5554 3.8702 3.9284 3.4445 4.2080 3.1732 4.8777 5.8130 3.1880 2.3836 4.9471 3.6374 9.1522 8.9224 6.9322 2.2070 5.3975 6.1208 4.4377 1.4821 4.2538 11.3932 5.3183 8.4092 1.6128 1.4149 2.3423 3.5679 3.6719 3.5207 5.0941 2.4232 1.3674 1.7713 1.3683 1.5051 3.2414 2.0910 1.7721 1.6604 2.3037 2.0028 1.6316 1.7218 1.4456 1.6427 1.2229 2.9193 1.2756 1.2687 1.4177 1.1273 1.1290 1.2140 1.2486 1.2857 1.3587 5.4732 4.7077 2.4077 1.0444 1.0445 1.0534 1.0704 1.0681 1.0889 2.8964 1.1397 1.2746 2.3476 6.5570 6.9883 1.0623 1.0623 1.0273 1.0267 1.0635 1.0634 1.1023 1.1028 1.1000 1.1003 1.0876 1.1062 1.1066 1.0935 1.0902 1.1077 1.1076 1.0956
irintensity: 1.4129 0.5848 1.7684 1.7055 0.4948 0.4082 1.7377 0.7656 3.4736 4.8256 21.7781 6.3494 1.2902 4.8971 13.2838 2.3787 2.3363 3.0664 7.7367 9.3066 3.0738 2.3403 11.9879 0.3716 5.9654 12.2289 10.1474 12.1014 0.1747 2.9312 4.1441 18.2315 8.5033 2.7799 11.5385 15.1743 41.9981 170.0451 16.6974 1.9125 2.1311 3.4302 8.2183 85.5661 4.1150 15.6596 28.6022 27.4408 7.9235 39.0850 9.4971 46.2608 64.9949 98.5543 21.9834 13.8290 11.9333 26.5633 71.2822 118.6597 18.3680 7.1675 3.0000 152.1201 25.2442 0.5997 1.2592 87.3217 80.7886 6.4659 3.6226 6.2580 11.3289 53.4065 6.8207 34.7311 30.7938 259.9570 82.7237 7.0882 7.9172 9.8087 20.6807 2.4733 27.1518 4.5236 95.1034 104.0966 36.3905 28.1549 3.4560 3.6135 14.8357 6.6100 17.4257 16.3991 6.6991 31.9026 72.3850 201.4680 1.3583 231.6398 13.6092 9.1149 6.7828 69.4280 35.8614 3.8480 8.2315 4.2873 0.6100 6.1546 15.4015 11.9948 51.9992 16.0145 6.8444 2.2313 0.1358 6.6197
temp: 298.150 k
press: 1.00000 atm
elementType: 16 16 8 8 8 8 8 8 8 8 7 7 6 6 6 6 6 6 6 6 6 6 6 6 1 1 1 1 1 1 1 1 1 1 1 1 1 1 1 1 1 1
symmnumber: 1
zpe: 801548.2 jmol-1
zpe.correction: 0.305294 hartree
zpe.thermalcorrener: 0.332033 hartree
zpe.thermalcorrenthalpy: 0.332977 hartree
zpe.thermalcorrgfe: 0.246337 hartree
zpe.sumelectzpe: -1973.199911 hartree
zpe.sumelectthermal: -1973.173171 hartree
zpe.sumelectthermalent: -1973.172227 hartree
zpe.sumelectthermalfe: -1973.258867 hartree
dipole: -5.4082 -3.0457 -1.7585
dipole: 6.4512
quadrupole: -182.8605 -174.9554 -152.6372
quadrupole: -23.5355 -11.7103 -6.6942
quadrupole: -12.7095 -4.8044 17.5138 -23.5355 -11.7103 -6.6942
hfenergy: -1973.5052041 hartree
pointgroup: C01 [X(C12H18N2O8S2)]
dipole: 2.0299716 1.2199738 0.9125657 debye
polarizability: 252.5926381|55.4187564|285.6230288|25.2624883|-34.1335946|183.2618923 unknown
InChI: InChI=1S/C12H18N2O8S2/c1-23(17,18)21-8-6-13(7-9-22-24(2,19)20)11-4-3-5-12(10-11)14(15)16/h3-5,10H,6-9H2,1-2H3
charge 0 multiplicity 1
42 atoms
S  3.809992 2.064497 0.063658
S  -0.274395 3.950786 -0.922775
O  2.919051 0.464861 -0.345281
O  -0.916392 2.57057 0.172109
O  5.252027 1.705684 0.696951
O  2.828714 3.042898 0.915327
O  -1.528498 4.671687 -1.64073
O  0.927824 3.396562 -1.868542
O  -4.21141 -4.78369 -0.274951
O  -4.064472 -2.839241 -1.45271
N  -0.006517 -0.436471 0.366042
N  -3.640988 -3.65837 -0.546454
C  1.033722 0.106761 1.257502
C  -0.356467 0.350334 -0.831647
C  -0.647583 -1.649951 0.648689
C  2.47325 -0.281359 0.861042
C  -1.449018 1.413289 -0.596673
C  -1.81256 -2.054913 -0.072121
C  -0.167161 -2.539381 1.667833
C  -2.427664 -3.283327 0.229251
C  -0.819256 -3.756289 1.946545
C  -1.965206 -4.161565 1.231229
C  3.934785 2.617376 -1.743321
C  0.405949 4.96744 0.522701
H  0.841895 -0.226779 2.293784
H  0.952886 1.207057 1.265636
H  -0.684758 -0.33284 -1.636253
H  0.553186 0.853046 -1.201244
H  3.182153 -0.107902 1.696459
H  2.545595 -1.340205 0.55431
H  -1.882414 1.763045 -1.555625
H  -2.268999 1.03208 0.037369
H  -2.270794 -1.439367 -0.848246
H  0.732866 -2.293368 2.238265
H  -0.414733 -4.405413 2.730413
H  -2.482017 -5.103267 1.424337
H  2.899821 2.847556 -2.041314
H  4.589334 3.500151 -1.737532
H  4.372983 1.7667 -2.281136
H  1.25898 4.384321 0.903187
H  0.701191 5.93383 0.090632
H  -0.423804 5.056969 1.235682
