program: Gaussian 09
title: 000264972
version: EM64L-G09RevD.01
frameworkgroup: C1[X(C17H18F3NO)]
method: RPBEPBE
basis: SDD
operation: Freq
keyword: #p
keyword: freq=noraman
keyword: PBEPBE/SDD
title: #p freq=noraman PBEPBE/SDD
converged: YES YES NO NO
title: Mulliken charges:
elementType: F F F O N C C C C C C C C C C C C C C C C C H H H H H H H H H H H H H H H H H H
charge: -0.158517 -0.162662 -0.166116 -0.444279 -0.113814 0.292616 0.272555 -0.449759 -0.479491 0.090166 0.430681 -0.326616 -0.378107 -0.244442 0.191767 -0.334805 -0.385970 -0.622118 -0.618357 -0.251309 -0.240062 -0.236839 0.260692 0.260721 0.208373 0.282687 0.269091 0.237585 0.241581 0.238707 0.222090 0.190191 0.223850 0.211750 0.198096 0.246571 0.350495 0.229866 0.230612 0.232520
chargesum: 0.00000
title: Mulliken charges with hydrogens summed into heavy atoms:
elementType: F F F O N C C C C C C C C C C C C C C C C C
charge: -0.158517 -0.162662 -0.166116 -0.093783 -0.113814 0.292616 0.272555 -0.189067 -0.010396 0.090166 0.430681 -0.043929 -0.109016 -0.006857 0.191767 -0.093224 -0.147264 0.014013 0.038060 -0.021442 -0.009450 -0.004319
polarizability: 2.01250721e+02 1.61289766e+01 2.14317696e+02 1.57858401e+01 7.95873501e+00 1.59267038e+02
1716.lowfreq: -12.5689 -5.5481 -0.0010 -0.0006 -0.0006 1.2751 6.8272 32.8762 43.6600
frequency: -10.9915 32.7544 43.5198 46.9538 61.2309 70.0533 85.0180 124.9739 136.2678 158.6418 176.9176 184.9855 225.6057 234.1352 239.3722 248.8293 257.2517 273.1856 291.9598 332.0017 334.3385 357.7636 372.4328 379.0767 401.3846 411.1914 444.3145 471.3753 485.2602 536.7174 563.6475 573.6278 600.3327 610.0402 616.8232 642.6340 703.0511 706.1844 738.0958 759.7079 796.2591 805.7177 827.7054 843.3399 851.2959 867.1069 915.0833 936.8184 941.2834 963.5101 974.9984 978.3787 990.5212 996.9291 1001.5864 1004.9213 1023.7248 1027.6654 1036.7766 1068.3972 1086.0376 1091.2666 1092.9168 1137.0636 1160.6853 1170.5569 1173.9157 1182.7455 1188.6749 1193.5905 1226.1368 1246.3094 1261.8127 1274.2142 1280.8003 1300.2162 1328.3650 1354.0672 1372.7279 1382.2677 1412.0303 1421.0549 1438.5432 1443.1822 1449.9616 1458.0999 1460.7421 1464.9282 1475.0360 1477.8031 1482.7190 1487.5791 1591.2211 1593.6111 1601.4985 1612.2310 2858.3708 2891.1885 2956.0699 3009.1060 3014.3292 3030.1562 3036.5151 3073.3717 3090.0179 3102.5266 3128.2936 3137.8144 3140.9804 3154.5951 3156.3653 3166.8724 3180.8475 3543.9372
redmass: 4.3089 5.3223 4.1884 3.8004 10.7366 3.0037 4.8443 5.0387 3.3811 5.5018 1.7991 2.9256 1.6302 2.3993 1.8395 2.1448 2.3227 4.0200 5.9055 2.9500 6.0448 6.7894 5.6489 2.1289 2.8272 3.1921 5.6527 6.4107 3.8837 4.9687 4.7527 5.3310 6.4405 8.1722 6.3058 5.5952 2.4966 3.0973 3.5901 2.1803 1.8076 4.3557 2.7861 3.8018 1.2638 4.5737 1.8955 1.5962 3.3564 5.2178 1.4249 1.8017 5.6167 1.3469 2.2141 2.6064 2.3912 2.2753 1.5828 3.0153 1.6594 1.8077 1.7665 1.4065 1.5965 1.9404 1.0757 2.3901 1.2445 1.1314 1.8033 1.7444 2.2938 2.8243 1.7121 1.5252 1.2346 2.1344 2.0322 5.2177 1.8440 1.1431 1.3995 1.6936 2.4684 1.0979 1.1851 1.7371 1.0860 1.0904 2.2142 1.0534 6.7426 5.8313 6.2648 6.0333 1.0561 1.0534 1.0577 1.1009 1.0731 1.0775 1.0834 1.1009 1.1003 1.0888 1.0858 1.0873 1.0914 1.0948 1.0939 1.1008 1.0964 1.0661
irintensity: 0.1243 0.3543 0.1639 0.1543 0.2994 1.6268 0.6704 0.6967 7.3527 7.6444 87.8535 26.9411 2.4644 1.6481 1.2188 0.9805 4.3307 5.6819 3.5304 12.0328 3.5104 8.0216 0.3860 2.2309 0.1692 1.0751 1.6325 1.5679 3.5376 5.4485 2.4444 2.1982 17.4250 11.6255 1.4703 6.8921 45.4397 5.3933 21.5165 66.6096 30.2178 13.1475 39.9850 3.0375 0.5134 40.4074 27.0642 25.6935 67.5916 134.2912 5.6060 39.6791 2.1294 0.3966 89.1448 96.3316 21.5593 4.0248 17.6031 117.6030 7.2222 28.5702 19.9243 10.0668 54.2962 10.4711 0.3261 4.5667 18.2088 2.8741 20.7404 9.1245 6.9938 150.1738 101.3389 16.2575 0.8084 6.7153 5.9074 2.5860 5.3693 4.5739 2.1438 11.2384 25.6585 9.7993 8.0376 7.1578 23.2200 8.9075 14.5443 10.3894 6.1055 1.3014 3.1977 2.7986 121.7729 112.4643 44.4292 9.8167 42.8895 44.3626 8.7207 34.6069 39.8933 10.2117 0.0419 1.1204 15.2903 33.1687 10.8952 17.7856 7.2382 5.8495
temp: 298.150 k
press: 1.00000 atm
elementType: 9 9 9 8 7 6 6 6 6 6 6 6 6 6 6 6 6 6 6 6 6 6 1 1 1 1 1 1 1 1 1 1 1 1 1 1 1 1 1 1
symmnumber: 1
zpe: 818423.0 jmol-1
zpe.correction: 0.311721 hartree
zpe.thermalcorrener: 0.332106 hartree
zpe.thermalcorrenthalpy: 0.333050 hartree
zpe.thermalcorrgfe: 0.262519 hartree
zpe.sumelectzpe: -1086.467129 hartree
zpe.sumelectthermal: -1086.446743 hartree
zpe.sumelectthermalent: -1086.445799 hartree
zpe.sumelectthermalfe: -1086.516330 hartree
dipole: -1.9656 2.9711 -0.9121
dipole: 3.6773
quadrupole: -130.7279 -119.0608 -123.1690
quadrupole: 9.0933 3.6609 5.6627
quadrupole: -6.4087 5.2584 1.1502 9.0933 3.6609 5.6627
hfenergy: -1086.7788495 hartree
pointgroup: C01 [X(C17H18F3N1O1)]
dipole: -0.251687 1.2581767 -0.6684154 debye
polarizability: 215.4481429|19.3613521|198.6568931|12.7917998|-8.7051094|160.7304194 unknown
InChI: InChI=1S/C17H18F3NO/c1-21(2)11-13-9-6-10-14(17(18,19)20)15(13)16(22)12-7-4-3-5-8-12/h3-10,16,22H,11H2,1-2H3
charge 0 multiplicity 1
40 atoms
F  1.068116 -4.068063 0.742956
F  2.234847 -2.1603 0.42154
F  1.086989 -2.483479 2.352825
O  -0.102719 1.236999 1.859839
N  -3.329694 1.680971 -0.170226
C  -0.404794 -0.617798 0.313541
C  -1.585126 -0.104268 -0.302971
C  0.638613 0.286682 0.976024
C  -1.901362 1.387429 -0.465922
C  -0.213574 -2.038073 0.314775
C  1.582333 1.036329 0.024433
C  -2.53173 -1.00299 -0.861405
C  -1.160403 -2.915016 -0.261098
C  -2.330789 -2.393714 -0.845443
C  1.005534 -2.669983 0.93612
C  1.352166 1.187772 -1.363964
C  2.750803 1.616627 0.586968
C  -3.748664 2.985906 -0.718857
C  -3.64463 1.558642 1.271144
C  2.254099 1.922364 -2.166297
C  3.64883 2.359151 -0.2085
C  3.399247 2.518626 -1.591747
H  1.274249 -0.321595 1.643151
H  -1.213509 1.998481 0.151597
H  -1.734363 1.661345 -1.528171
H  -3.440016 -0.563637 -1.287843
H  -0.980827 -3.99288 -0.245158
H  -3.07221 -3.069191 -1.284153
H  0.483906 0.709371 -1.827928
H  2.976404 1.461261 1.651091
H  -3.574081 3.007803 -1.810145
H  -3.209853 3.85631 -0.265299
H  -4.829726 3.129262 -0.541288
H  -4.731632 1.688321 1.420778
H  -3.105589 2.307864 1.899954
H  -3.360664 0.555684 1.63136
H  0.555174 1.883695 2.225245
H  2.065891 2.02332 -3.241054
H  4.546325 2.796473 0.242688
H  4.09753 3.0871 -2.215857
