program: Gaussian 09
title: 000264959
version: EM64L-G09RevD.01
frameworkgroup: C1[X(C14H19NO2)]
method: RPBEPBE
basis: SDD
operation: Freq
keyword: #p
keyword: freq=noraman
keyword: PBEPBE/SDD
title: #p freq=noraman PBEPBE/SDD
converged: YES YES NO NO
title: Mulliken charges:
elementType: O O N C C C C C C C C C C C C C C H H H H H H H H H H H H H H H H H H H
charge: -0.449176 -0.259074 -0.454893 -0.032792 -0.124061 -0.447959 -0.449759 -0.401392 -0.386207 -0.614666 0.194766 0.488165 -0.453877 -0.352327 -0.197435 -0.214124 -0.256135 0.207716 0.225108 0.264173 0.184436 0.223631 0.179983 0.192592 0.206607 0.197490 0.204170 0.250717 0.234085 0.323052 0.309460 0.219379 0.308153 0.225624 0.226189 0.228382
chargesum: 0.00000
title: Mulliken charges with hydrogens summed into heavy atoms:
elementType: O O N C C C C C C C C C C C C C C
charge: -0.126124 -0.259074 -0.145433 0.174923 0.101048 0.000649 -0.046145 -0.002193 0.015454 -0.129863 0.194766 0.488165 -0.234498 -0.044174 0.028189 0.012064 -0.027753
polarizability: 2.25697166e+02 -6.69030590e+00 1.59734082e+02 1.94758884e+01 -2.83790691e+00 1.08535317e+02
1716.lowfreq: -19.5954 -6.6411 -0.0006 -0.0002 0.0005 1.3541 14.9202 27.8733 39.6100
frequency: 14.4986 27.7210 38.7495 80.6340 91.0879 135.6900 151.1206 178.6870 238.5174 254.3535 274.1792 309.6434 322.0953 336.6528 367.5882 378.9464 408.8372 416.2648 432.1734 484.2128 514.7337 532.1566 540.7557 614.2413 655.1785 658.2497 698.1672 719.9890 770.4484 784.4476 809.6694 832.0920 844.7773 844.8945 880.8810 890.0972 919.5166 924.4680 937.6403 966.6586 973.7387 984.5704 996.0125 1002.5149 1026.5740 1049.1956 1054.3307 1061.1343 1084.8606 1088.6440 1107.5086 1122.5895 1165.6010 1171.8695 1187.3462 1191.7496 1206.9321 1217.9626 1251.8899 1258.0412 1268.2927 1283.8756 1303.9550 1313.5921 1319.9324 1332.5740 1336.2557 1340.3806 1343.5257 1356.5837 1364.4421 1384.1760 1425.3306 1461.5443 1465.1872 1466.3821 1469.1510 1477.5432 1485.4145 1506.4083 1597.7796 1613.7229 1619.4213 2937.2255 2946.0093 2965.2683 2972.6027 2974.1182 2993.4032 3018.8446 3035.0743 3039.4946 3047.1284 3056.7165 3060.4955 3108.2426 3131.2330 3143.8140 3164.5115 3194.6397 3526.0338 3540.7239
redmass: 5.1834 4.1743 4.0711 5.5535 3.5347 4.7080 5.0397 2.4645 4.1832 4.1674 2.1825 1.2759 1.7888 6.1279 2.4491 3.7145 2.9405 3.8605 3.6323 2.7687 3.0249 3.4979 1.9151 6.3921 1.8795 1.7934 1.9747 5.0558 1.7108 2.0000 2.9673 2.1088 1.4481 2.0042 2.5659 1.5791 1.4325 1.9950 5.8664 2.1199 1.3478 6.0718 3.0042 1.3048 2.1420 1.5281 1.7960 2.0751 1.5147 1.5460 2.5584 1.6903 1.8332 1.0525 1.1164 1.4937 1.4015 1.7988 1.4452 1.5737 1.3897 1.3441 1.2786 1.3338 1.4672 1.4065 1.4026 1.4075 1.4519 1.4287 1.2653 5.8668 2.3932 1.0925 1.0953 1.1303 1.0892 1.0913 2.3055 2.1351 6.8368 4.8202 5.0212 1.0803 1.0676 1.0688 1.0632 1.0612 1.0591 1.0851 1.0967 1.0976 1.0986 1.0974 1.1027 1.0886 1.0867 1.0933 1.0999 1.0952 1.0763 1.0657
irintensity: 1.7415 0.7839 0.9654 5.8946 0.3281 5.4558 5.4118 2.4480 6.8819 6.2887 33.5959 89.4137 1.3331 5.0034 3.6732 31.5350 0.4108 6.6707 4.5699 1.8680 19.6145 13.3816 1.0784 0.7476 17.5084 14.9434 52.8774 0.5445 91.6625 6.5573 3.9313 6.8760 3.2574 10.0376 22.8031 3.6588 13.6713 3.2080 3.4129 19.8662 0.1325 0.5007 47.7782 3.3845 6.2184 10.5610 7.9318 8.6946 57.2803 17.4745 6.1478 5.9759 22.4694 0.5287 1.8669 19.6448 1.7780 16.8168 0.7969 18.0471 27.7127 7.2704 7.4525 17.6396 87.8088 1.9280 0.3007 0.2453 3.4622 7.4851 19.8027 82.1640 117.5805 6.0898 4.7832 33.7457 11.9252 7.9971 57.3670 356.2944 66.4715 62.2447 68.8678 3.3675 33.7826 17.5811 40.1953 40.6547 16.5153 25.0808 58.5299 47.3319 69.1878 28.6982 27.9133 15.0344 0.5572 31.3454 25.9159 8.1537 11.7035 4.1288
temp: 298.150 k
press: 1.00000 atm
elementType: 8 8 7 6 6 6 6 6 6 6 6 6 6 6 6 6 6 1 1 1 1 1 1 1 1 1 1 1 1 1 1 1 1 1 1 1
symmnumber: 1
zpe: 800749.3 jmol-1
zpe.correction: 0.304989 hartree
zpe.thermalcorrener: 0.320977 hartree
zpe.thermalcorrenthalpy: 0.321921 hartree
zpe.thermalcorrgfe: 0.259513 hartree
zpe.sumelectzpe: -748.823416 hartree
zpe.sumelectthermal: -748.807428 hartree
zpe.sumelectthermalent: -748.806484 hartree
zpe.sumelectthermalfe: -748.868893 hartree
dipole: 1.1524 2.1278 -1.8073
dipole: 3.0203
quadrupole: -91.6962 -104.5378 -103.3731
quadrupole: -6.6720 0.4068 -1.2995
quadrupole: 8.1728 -4.6688 -3.5040 -6.6720 0.4068 -1.2995
hfenergy: -749.1284054 hartree
pointgroup: C01 [X(C14H19N1O2)]
dipole: -0.521376 0.7518683 0.7581703 debye
polarizability: 223.1094149|7.4432722|159.4040262|24.8589861|8.4366667|111.4531244 unknown
InChI: InChI=1S/C14H19NO2/c16-13-9-5-4-6-11(13)10-14(17)15-12-7-2-1-3-8-12/h1-3,7-8,11,13,15-16H,4-6,9-10H2
charge 0 multiplicity 1
36 atoms
O  -2.79834 2.290037 -0.346591
O  0.553962 -1.632386 -1.257671
N  1.245926 0.536227 -0.670166
C  -2.131475 -0.121002 -0.468523
C  -3.292058 0.905445 -0.545301
C  -2.672142 -1.564858 -0.644424
C  -4.414448 0.574296 0.459158
C  -3.781518 -1.894988 0.379066
C  -4.938575 -0.872271 0.287358
C  -1.034564 0.224764 -1.520494
C  0.317595 -0.389341 -1.158527
C  2.571573 0.317318 -0.196225
C  3.308225 1.45672 0.229931
C  3.170441 -0.970043 -0.134696
C  4.624612 1.314749 0.712224
C  4.490501 -1.093986 0.350972
C  5.226051 0.035802 0.77642
H  -1.689979 -0.035971 0.550355
H  -3.697277 0.923518 -1.574993
H  -1.831305 -2.277512 -0.572027
H  -3.082996 -1.665316 -1.671605
H  -5.232364 1.309969 0.343099
H  -4.01085 0.691323 1.489695
H  -3.356853 -1.879255 1.404197
H  -4.161558 -2.920002 0.20665
H  -5.431884 -0.967169 -0.701792
H  -5.711096 -1.083683 1.051121
H  -0.969897 1.325435 -1.608374
H  -1.341024 -0.180583 -2.502678
H  -2.628744 2.41535 0.622849
H  0.930808 1.509258 -0.655455
H  2.849574 2.453441 0.180936
H  2.601445 -1.839822 -0.467234
H  5.179647 2.202166 1.036136
H  4.946695 -2.089489 0.394917
H  6.249293 -0.075939 1.150391
