program: Gaussian 09
title: 000264953
version: EM64L-G09RevD.01
frameworkgroup: C1[X(C13H15N)]
method: RPBEPBE
basis: SDD
operation: Freq
keyword: #pfreq=noraman
keyword: PBEPBE/SDD
title: #p freq=noraman PBEPBE/SDD
converged: YES YES NO NO
title: Mulliken charges:
elementType: N C C C C C C C C C C C C C H H H H H H H H H H H H H H H
charge: -0.109423 0.297692 -0.460143 0.156851 0.408160 -0.399621 -0.383339 -0.454234 -0.247748 -0.426279 -0.637266 -0.619423 -0.261758 -0.246391 0.228002 0.191043 0.281423 0.232003 0.236460 0.225033 0.235543 0.189187 0.223094 0.251501 0.228217 0.222714 0.187286 0.224605 0.226813
chargesum: 0.00000
title: Mulliken charges with hydrogens summed into heavy atoms:
elementType: N C C C C C C C C C C C C C
charge: -0.109423 0.297692 -0.041098 0.156851 0.408160 -0.118197 -0.151335 -0.217775 -0.022715 -0.190736 0.026515 0.018794 -0.037153 -0.019578
polarizability: 1.96212473e+02 -1.36828836e+01 1.67334637e+02 7.11415539e+00 -1.41235741e+00 7.89220674e+01
1716.lowfreq: -12.0844 -0.0005 -0.0004 0.0001 5.2576 12.1180 39.4990 70.6838 109.4010
frequency: 39.2901 70.6503 109.3982 140.4533 183.0592 226.6318 231.0843 235.2723 248.3051 326.2549 358.4664 401.0565 409.8329 449.6361 474.6951 500.0031 520.8983 536.5867 618.1945 636.1777 727.1473 744.8817 784.7936 785.9187 812.6694 818.0495 859.7174 872.8169 936.5135 956.7250 978.3540 989.1542 996.2267 1011.6457 1030.7272 1037.3422 1054.4792 1076.2528 1090.1192 1135.6955 1150.2057 1168.4252 1172.5034 1180.5631 1232.4254 1235.1272 1265.8720 1267.5042 1300.8163 1339.0358 1382.5609 1404.2782 1418.2974 1419.9773 1436.3794 1440.1990 1451.3913 1461.2014 1462.4274 1474.7586 1478.3642 1486.4088 1517.7810 1590.5367 1598.6266 1632.1810 2844.9568 2851.9818 2867.0790 2987.3435 3017.8851 3026.8176 3076.9021 3086.9593 3118.1162 3119.8283 3129.3449 3137.6162 3146.3724 3154.6531 3161.6975
redmass: 2.9969 2.8441 3.0319 3.4018 4.0910 1.5600 1.0612 1.9871 3.4747 2.9739 2.0170 2.9860 3.0707 2.9368 3.3298 6.0276 5.5108 3.1201 5.4396 3.4655 4.7561 1.2357 2.5732 5.0630 1.8742 2.4014 4.0531 1.6175 1.4270 1.4242 1.7531 1.3563 2.2839 1.6686 2.3188 1.5522 2.1349 2.1300 1.2549 1.4034 1.4272 1.5367 1.2843 1.2015 1.7150 2.2275 2.2817 1.9587 1.5480 1.7094 1.9302 2.9198 1.1406 4.1653 1.2629 2.3145 1.9554 1.1023 1.1262 1.0927 1.0554 1.0555 3.6699 7.3227 5.4440 6.5736 1.0658 1.0590 1.0584 1.0861 1.0724 1.0728 1.1010 1.1008 1.0863 1.0858 1.0881 1.0917 1.0941 1.0983 1.1002
irintensity: 0.1370 0.9207 0.9387 0.2650 3.0893 0.0768 0.7430 1.0556 2.7619 5.2863 6.0037 4.0730 6.2550 1.1505 0.2070 0.7710 1.2726 7.3438 4.3035 0.3707 0.5596 12.8011 36.0179 1.8801 47.2741 52.1586 3.0697 9.0365 1.6840 3.6504 0.8685 0.6839 20.0602 11.2599 4.9815 19.8962 40.9559 7.9251 7.4240 7.7055 1.9995 2.4895 1.9918 0.2712 6.3494 7.3177 11.8037 1.0960 5.1938 21.1239 3.3775 4.2757 4.4891 8.3231 5.5511 1.8400 5.9313 13.1568 8.7198 15.8671 11.3551 10.4606 9.6674 0.8948 10.0401 0.8327 54.9023 61.4828 223.4481 20.5756 42.0405 35.9735 30.6786 41.7550 1.0624 4.1434 5.1341 11.4565 37.1745 33.9055 28.4217
temp: 298.150 k
press: 1.00000 atm
elementType: 7 6 6 6 6 6 6 6 6 6 6 6 6 6 1 1 1 1 1 1 1 1 1 1 1 1 1 1 1
symmnumber: 1
zpe: 640663.5 jmol-1
zpe.correction: 0.244016 hartree
zpe.thermalcorrener: 0.256559 hartree
zpe.thermalcorrenthalpy: 0.257503 hartree
zpe.thermalcorrgfe: 0.205115 hartree
zpe.sumelectzpe: -558.109953 hartree
zpe.sumelectthermal: -558.097410 hartree
zpe.sumelectthermalent: -558.096466 hartree
zpe.sumelectthermalfe: -558.148854 hartree
dipole: -0.7478 -0.8836 0.2810
dipole: 1.1912
quadrupole: -73.2833 -76.5924 -88.1896
quadrupole: 2.3066 0.1508 1.0184
quadrupole: 6.0718 2.7627 -8.8345 2.3066 0.1508 1.0184
hfenergy: -558.3539686 hartree
pointgroup: C01 [X(C13H15N1)]
dipole: 0.2839304 0.3631316 0.0845309 debye
polarizability: 196.9651763|-13.4152742|166.0118528|0.3887618|-9.3301507|79.4921478 unknown
InChI: InChI=1S/C13H15N/c1-14(2)10-12-8-5-7-11-6-3-4-9-13(11)12/h3-9H,10H2,1-2H3
charge 0 multiplicity 1
29 atoms
N  3.083003 0.252489 0.104325
C  0.610606 -0.169868 -0.131731
C  1.773978 0.810961 -0.300335
C  -0.757905 0.299262 -0.125731
C  -1.833825 -0.667419 0.01049
C  0.865457 -1.541895 -0.026028
C  -1.110772 1.686402 -0.263196
C  -1.52216 -2.062231 0.128812
C  -0.194998 -2.490205 0.106468
C  -3.194024 -0.211253 0.017303
C  3.237341 0.181863 1.572047
C  4.220362 0.932663 -0.54373
C  -2.445553 2.10001 -0.256128
C  -3.499838 1.144504 -0.111553
H  1.843168 1.093888 -1.370687
H  1.553989 1.757185 0.256564
H  1.910528 -1.869055 -0.051604
H  -0.322363 2.436852 -0.381606
H  -2.342528 -2.782725 0.231828
H  0.043999 -3.556361 0.190037
H  -3.995249 -0.952854 0.123685
H  3.260741 1.191321 2.056177
H  4.176392 -0.342524 1.823995
H  2.398212 -0.385665 2.009044
H  4.114291 0.877408 -1.641884
H  5.160317 0.422382 -0.266085
H  4.320871 2.010817 -0.257322
H  -2.690241 3.162883 -0.362705
H  -4.542398 1.481263 -0.105548
