program: Gaussian 09
title: 000264950
version: EM64L-G09RevD.01
frameworkgroup: C1[X(C12H11NO)]
method: RPBEPBE
basis: SDD
operation: Freq
keyword: #p
keyword: freq=noraman
keyword: PBEPBE/SDD
title: #p freq=noraman PBEPBE/SDD
converged: YES YES NO NO
title: Mulliken charges:
elementType: O N C C C C C C C C C C C C H H H H H H H H H H H
charge: -0.289646 -0.396702 0.366999 0.394256 0.299684 -0.555978 -0.435941 -0.363286 -0.407150 -0.407921 -0.239975 -0.236350 0.170299 -0.611438 0.283771 0.237021 0.208454 0.246237 0.239716 0.230903 0.229686 0.307009 0.225698 0.225496 0.279159
chargesum: 0.00000
title: Mulliken charges with hydrogens summed into heavy atoms:
elementType: O N C C C C C C C C C C C C
charge: -0.289646 -0.089693 0.366999 0.394256 0.299684 -0.272207 -0.198920 -0.154832 -0.160913 -0.168206 -0.009073 -0.006663 0.170299 0.118914
polarizability: 2.39403614e+02 -1.16910693e+01 1.41335375e+02 1.12896779e+00 -3.92265347e-01 6.08032048e+01
1716.lowfreq: -0.0004 0.0006 0.0007 6.1364 12.1576 15.0235 35.8233 77.7034 105.3356
frequency: 35.8104 77.6315 105.3311 121.0865 162.4854 184.7292 251.7714 282.4235 309.3566 360.3671 395.9399 469.0089 484.1319 513.1566 517.0060 556.9116 578.1908 630.0581 632.8193 718.0829 760.1861 766.6807 769.3843 790.4532 825.4372 860.0736 882.4606 936.4969 947.7332 961.4575 978.6775 995.8961 1018.4509 1027.8563 1119.0112 1122.3777 1133.1492 1147.8362 1169.0079 1174.5330 1218.4965 1238.9706 1274.2666 1284.7591 1350.1826 1410.6423 1416.3226 1424.1883 1435.0288 1451.3167 1467.1709 1488.8188 1510.8868 1520.4067 1573.6318 1599.1156 1605.9508 1641.7488 2976.4920 3054.9321 3109.9142 3117.2244 3122.0612 3129.6001 3141.1635 3145.0166 3145.6211 3163.7885 3571.9444
redmass: 4.1439 3.5924 1.1513 3.8111 3.8606 3.5874 4.9932 5.1673 4.5676 4.7254 3.1541 3.6886 2.7046 6.2022 4.3319 1.2184 6.3261 4.7760 4.4857 2.3660 4.2915 4.2796 1.6941 2.7116 1.4684 4.1320 1.6034 4.5338 1.4266 1.4733 1.4423 1.3542 2.9702 2.5056 1.8158 1.3935 1.6685 1.8089 1.2555 1.1039 1.8018 1.9652 1.7395 2.0549 1.8794 5.5375 1.1999 2.7435 4.2372 1.5252 1.8175 1.0476 2.6923 1.7928 7.1296 6.4539 6.1386 6.9667 1.0350 1.1023 1.0978 1.0859 1.0861 1.0885 1.0957 1.0950 1.0932 1.1005 1.0771
irintensity: 7.8092 0.4946 0.6644 2.9227 0.7358 1.2559 2.9789 4.3921 4.0514 16.0552 0.2661 6.5728 31.2219 4.5125 3.1014 101.7038 5.0562 1.2310 1.8121 3.4629 2.5711 3.8160 67.3747 0.9900 56.0812 6.3805 11.1499 7.6643 7.0361 2.4693 15.2785 0.2277 0.3670 8.5732 3.4180 1.8804 51.6347 12.3832 8.1854 3.0562 89.7254 12.2578 6.7263 85.0652 2.9581 3.5485 36.5049 1.1959 2.5984 86.1434 39.8971 16.7847 64.8319 137.5624 29.8220 61.6105 56.2966 5.6248 95.2727 38.5015 1.5746 8.7893 2.9379 0.3125 18.1097 35.6412 3.8221 34.0765 13.8029
temp: 298.150 k
press: 1.00000 atm
elementType: 8 7 6 6 6 6 6 6 6 6 6 6 6 6 1 1 1 1 1 1 1 1 1 1 1
symmnumber: 1
zpe: 522547.5 jmol-1
zpe.correction: 0.199028 hartree
zpe.thermalcorrener: 0.210864 hartree
zpe.thermalcorrenthalpy: 0.211808 hartree
zpe.thermalcorrgfe: 0.160432 hartree
zpe.sumelectzpe: -592.899594 hartree
zpe.sumelectthermal: -592.887757 hartree
zpe.sumelectthermalent: -592.886813 hartree
zpe.sumelectthermalfe: -592.938189 hartree
dipole: 0.6271 3.5938 1.0593
dipole: 3.7988
quadrupole: -65.2804 -76.2639 -87.0844
quadrupole: -11.5016 -3.1581 -1.3861
quadrupole: 10.9292 -0.0543 -10.8748 -11.5016 -3.1581 -1.3861
hfenergy: -593.0986217 hartree
pointgroup: C01 [X(C12H11N1O1)]
dipole: 0.2521833 1.4142797 0.4122183 debye
dipolederiv: -0.870472 -0.1717226 -0.0066309 -0.107473 -0.901986 -0.1637979 0.0479647 -0.1152775 -0.4063547 -1.1775151 0.3180131 0.1354043 0.3293995 -0.5495952 -0.0173268 0.1580923 0.0015245 -0.492484 0.0461184 -0.0879857 0.004578 -0.0999992 -0.0863069 0.0055 0.0124262 0.0045031 0.0281339 0.1539771 -0.0640037 0.0068404 -0.0455147 -0.1179226 0.0082967 0.0084485 0.0067183 0.0468574 -0.5378031 0.0383547 0.000078 -0.0818122 -0.0380429 -0.0205944 -0.0542743 -0.0205064 -0.0050196 0.0645197 0.0346764 0.0023919 -0.0460661 0.0421574 -0.0095171 -0.0273108 0.007328 -0.1234897 -0.1452564 0.0286205 -0.0019519 0.0126256 0.134959 -0.0221058 0.0049626 -0.0211108 -0.1638828 -0.0543178 -0.0696955 0.0258573 0.0752202 0.0446064 -0.0247688 0.0950076 -0.0193725 -0.1635905 -0.0679226 0.0722907 -0.0003852 -0.0402439 0.1112033 -0.0124745 0.0049389 -0.008732 -0.1595406 -0.1113109 0.057138 -0.0011765 0.135067 0.101794 -0.0115572 -0.0062588 -0.0148266 -0.1730853 -0.0194596 -0.1291349 0.0090984 -0.0914776 0.0541987 -0.0112681 0.0018794 -0.0124268 -0.1605192 0.07178 0.0963517 -0.0003351 0.0404654 0.0025162 -0.0066462 0.0017955 -0.0050653 -0.1542085 1.8482524 -0.1406488 -0.1401505 -0.1979677 1.1265943 0.3040251 -0.203789 0.2280013 0.2943427 0.5553651 -0.0710106 -0.0391947 0.2033932 0.0064266 -0.0909927 0.0045622 -0.069362 0.2463026 0.133622 -0.0068026 -0.0006485 -0.0236871 -0.0015385 0.0115885 0.0198904 0.0038513 0.1492037 0.0459376 -0.0756097 0.0026613 -0.029681 -0.0946295 0.0176847 -0.0047707 0.0190087 0.152501 -0.0534155 0.127537 -0.0139233 0.1232171 0.0041568 0.0149979 -0.0318551 0.0075984 0.1461824 0.069116 -0.0777551 0.0016455 -0.0071181 -0.0777161 0.0114118 0.0002995 0.0093919 0.1554214 0.061243 -0.0064231 -0.0009568 -0.0843228 -0.1006601 0.0120409 0.002663 0.01277 0.1564922 -0.0399884 0.1094882 -0.0079508 0.118294 -0.0151654 0.0098738 -0.0086089 0.0096958 0.161323 -0.1310929 -0.0550171 -0.0016518 -0.0570918 0.0762412 0.0032839 -0.0015071 0.0032978 0.1604657 0.1977841 -0.0532459 -0.0045411 -0.0970378 0.1229725 -0.0608517 -0.0309207 -0.0682639 0.3174267 -0.1289969 0.0726306 -0.0437103 0.0994171 0.0278433 0.1158244 -0.1143867 0.1085452 0.0017943 -0.0847999 0.0229806 0.0675385 -0.0041245 0.1228255 -0.0309765 0.1542441 -0.0272923 -0.1347338 0.1746356 0.0309734 0.0071138 -0.1234814 0.0050681 -0.0316502 -0.0334927 -0.0399982 0.1204619 unknown
polarizability: 239.4172302|-11.579147|141.3074917|-1.9503713|-0.2051044|60.8174722 unknown
InChI: InChI=1S/C12H11NO/c1-13-12(14)11-7-6-9-4-2-3-5-10(9)8-11/h2-8,13H,1H3
charge 0 multiplicity 1
25 atoms
O  -2.885688 -1.635471 -0.268609
N  -3.555811 0.517384 0.306946
C  1.233332 -0.551042 0.032343
C  1.596638 0.851131 -0.029091
C  -1.157745 0.05987 -0.023428
C  -0.150159 -0.91132 0.028966
C  0.550462 1.829325 -0.103749
C  -0.79076 1.448236 -0.100868
C  2.274434 -1.537016 0.094894
C  2.983798 1.212707 -0.024954
C  3.617757 -1.155714 0.09808
C  3.975119 0.230198 0.038232
C  -2.587117 -0.424991 -0.013512
C  -4.982439 0.179994 0.350949
H  -0.450772 -1.964692 0.06257
H  0.821208 2.889481 -0.174682
H  -1.560013 2.223422 -0.201247
H  1.997153 -2.596705 0.139998
H  3.257293 2.273605 -0.072852
H  4.406002 -1.914788 0.145946
H  5.032971 0.515285 0.041532
H  -3.267102 1.452083 0.594339
H  -5.565732 0.815057 -0.341367
H  -5.39237 0.291612 1.372327
H  -5.08086 -0.873251 0.043434
