program: Gaussian 09
title: 000264961
version: EM64L-G09RevD.01
frameworkgroup: C1[X(C14H23NO)]
method: RPBEPBE
basis: SDD
operation: Freq
keyword: #p
keyword: freq=noraman
keyword: PBEPBE/SDD
title: #p freq=noraman PBEPBE/SDD
converged: YES YES NO NO
title: Mulliken charges:
elementType: O N C C C C C C C C C C C C C C H H H H H H H H H H H H H H H H H H H H H H H
charge: -0.467269 -0.088403 0.074937 0.341076 0.210214 0.160191 -0.562383 -0.413609 0.345820 -0.751740 -0.719745 -0.503777 -0.822422 -0.849033 -0.620225 -0.628340 0.272982 0.214354 0.232593 0.202526 0.209738 0.253472 0.201519 0.223841 0.251574 0.226167 0.213686 0.229020 0.270187 0.330738 0.232324 0.230319 0.228634 0.223882 0.187828 0.219405 0.218901 0.174843 0.246175
chargesum: 0.00000
title: Mulliken charges with hydrogens summed into heavy atoms:
elementType: O N C C C C C C C C C C C C C C
charge: -0.136531 -0.088403 0.074937 0.341076 0.210214 0.160191 -0.075047 -0.181015 0.345820 -0.086003 -0.042812 -0.277610 -0.109530 -0.157756 0.010891 0.011578
polarizability: 1.92515294e+02 3.06490409e+00 1.80893097e+02 3.98115025e+00 -1.09618165e+01 1.17557400e+02
1716.lowfreq: -53.0358 -5.8405 -3.2055 -0.0006 -0.0006 -0.0005 11.7292 44.6067 64.0349
frequency: -52.9752 44.4499 64.0291 68.3757 95.3986 111.3667 153.3399 191.8762 202.2941 218.8000 221.9943 230.4700 267.5675 274.6802 281.8116 293.4611 302.6817 315.4452 329.7558 332.0721 364.3273 376.8181 386.9659 407.9228 428.5145 448.6357 502.2259 521.2696 539.4586 566.1245 606.6327 659.8057 681.8557 757.9916 801.8237 816.8233 821.5283 861.1760 903.7268 906.6089 940.2949 946.6617 979.8783 998.0773 1008.1517 1016.8923 1027.1194 1038.9507 1052.3324 1075.4297 1085.0950 1087.4725 1131.9994 1152.2574 1159.2253 1168.9959 1192.5263 1202.6298 1224.5715 1259.1041 1263.8039 1271.9816 1325.0548 1344.6194 1363.0182 1377.4519 1393.0295 1396.5587 1400.5208 1402.5675 1414.6366 1435.5753 1443.0843 1453.9965 1455.7828 1458.8925 1464.4158 1470.8967 1474.4386 1476.8547 1479.0756 1484.8510 1487.6466 1491.7769 1493.2128 1505.8285 1581.4532 1605.8073 2829.4058 2845.0139 2962.0056 2971.8642 2974.9190 2979.9871 2986.2542 3006.1973 3007.0547 3012.6004 3048.8925 3060.1951 3060.9693 3066.5188 3068.8643 3077.5348 3078.7416 3098.9025 3102.1946 3118.2511 3119.8996 3163.9629 3531.3603
redmass: 1.1559 2.6776 3.3213 3.3143 3.0889 2.5575 2.5234 2.2168 1.3155 1.8150 1.3213 1.2980 1.2443 2.8101 1.3593 1.8649 2.0978 1.4570 2.5766 2.0321 2.6639 2.6910 2.1366 2.8733 2.4541 3.1644 3.9235 2.9638 3.4041 3.6602 3.3180 4.6010 4.1042 3.4372 3.8069 1.8500 2.5925 3.3540 2.5376 1.5341 1.9780 1.3674 1.6505 1.3326 1.5916 2.0505 1.5144 1.4902 1.6604 1.8914 1.4139 1.3443 1.4556 2.1016 2.2966 1.8946 2.5932 3.0604 1.6498 2.6614 2.3171 1.6777 2.2530 2.1812 2.1790 1.2183 1.2387 1.4455 1.6539 1.5387 1.1429 1.1692 1.1483 1.1316 1.1065 1.0702 1.1539 1.0625 1.0637 1.1456 1.1457 1.1663 1.0673 1.2185 1.1004 1.0751 5.6865 6.8619 1.0578 1.0577 1.0587 1.0377 1.0394 1.0386 1.0383 1.0812 1.0883 1.0723 1.0967 1.0968 1.0946 1.1009 1.0963 1.0988 1.0995 1.0985 1.1005 1.0892 1.0960 1.0930 1.0657
irintensity: 0.8298 0.4944 0.2445 0.8452 3.1448 0.7927 0.8772 0.5148 0.2624 0.6420 1.7843 7.6270 74.4328 20.9485 24.0618 4.3847 2.0321 3.7731 3.0804 4.7078 1.3586 1.0713 3.2268 3.5434 3.6337 3.8551 4.2842 1.7629 5.6145 1.0595 2.4735 2.7411 0.9894 3.8911 20.2634 32.6615 24.3522 10.9458 3.1237 0.4422 0.8348 0.2606 17.2727 5.1746 17.7431 32.5436 29.9533 8.0921 1.2639 2.1443 44.6850 54.6240 4.9619 12.7518 28.4705 1.4245 7.8798 4.2129 11.6759 7.6735 8.8580 7.4190 44.1371 13.3335 15.9203 20.0848 5.5122 2.6629 34.4856 5.9969 2.8655 4.7519 10.1785 1.3921 4.7809 17.6548 10.2448 21.5469 3.8223 7.1499 20.1973 9.1890 13.8929 17.7117 16.2694 12.5823 0.5836 2.9913 83.6153 220.6598 31.9046 39.5689 12.8353 55.5278 31.0656 54.5316 10.5710 44.7397 21.5894 2.3991 18.8923 31.9754 72.9636 26.3599 37.7141 20.7417 21.7226 21.2914 9.9669 21.9980 7.3733
temp: 298.150 k
press: 1.00000 atm
elementType: 8 7 6 6 6 6 6 6 6 6 6 6 6 6 6 6 1 1 1 1 1 1 1 1 1 1 1 1 1 1 1 1 1 1 1 1 1 1 1
symmnumber: 1
zpe: 888204.5 jmol-1
zpe.correction: 0.338299 hartree
zpe.thermalcorrener: 0.356043 hartree
zpe.thermalcorrenthalpy: 0.356987 hartree
zpe.thermalcorrgfe: 0.294470 hartree
zpe.sumelectzpe: -675.980559 hartree
zpe.sumelectthermal: -675.962815 hartree
zpe.sumelectthermalent: -675.961871 hartree
zpe.sumelectthermalfe: -676.024389 hartree
dipole: 1.6469 0.3249 0.9380
dipole: 1.9230
quadrupole: -86.7301 -93.5971 -101.8632
quadrupole: 0.8112 0.9933 -1.9194
quadrupole: 7.3334 0.4664 -7.7998 0.8112 0.9933 -1.9194
hfenergy: -676.3188585 hartree
pointgroup: C01 [X(C14H23N1O1)]
dipole: -0.6405687 0.0286679 0.4015379 debye
polarizability: 192.881853|0.7868005|181.2485064|-5.6094849|7.9335834|116.8354323 unknown
InChI: InChI=1S/C14H23NO/c1-10-7-8-13(14(3,4)16)12(11(10)2)9-15(5)6/h7-8,16H,9H2,1-6H3
charge 0 multiplicity 1
39 atoms
O  -2.601972 -0.014434 -1.256456
N  0.343166 -2.57448 0.374778
C  -2.257811 0.789046 -0.039483
C  -0.71491 0.931367 -0.037056
C  0.19378 -0.146584 -0.306509
C  1.60474 0.112499 -0.379534
C  -0.275569 -1.583336 -0.556892
C  -0.172278 2.206464 0.259701
C  2.121762 1.405099 -0.066333
C  -2.997903 2.142492 -0.180363
C  -2.776982 0.062844 1.230788
C  1.215034 2.433233 0.273479
C  2.566362 -0.985275 -0.809654
C  3.611463 1.712314 -0.097868
C  0.150394 -3.957749 -0.093747
C  -0.047251 -2.404237 1.784245
H  -1.381436 -1.637773 -0.549536
H  0.028368 -1.883627 -1.580757
H  -0.835025 3.046985 0.480719
H  -4.080998 1.949514 -0.309654
H  -2.893213 2.780283 0.714756
H  -2.637719 2.696884 -1.0632
H  -3.882945 0.000757 1.216313
H  -2.477898 0.614528 2.140372
H  -2.373686 -0.958434 1.300026
H  1.598507 3.42958 0.524664
H  2.172192 -1.540476 -1.681127
H  3.551839 -0.578523 -1.087474
H  2.690623 -1.736305 -0.010332
H  -3.591445 -0.034978 -1.332926
H  4.191008 1.02188 0.542744
H  4.027959 1.630324 -1.120408
H  3.802485 2.740377 0.255328
H  0.569781 -4.072425 -1.110375
H  -0.925137 -4.272899 -0.13022
H  0.682232 -4.656982 0.577437
H  0.575722 -3.057929 2.422769
H  -1.120663 -2.659923 1.985524
H  0.121319 -1.358596 2.094464
