program: Gaussian 09
title: 000264951
version: EM64L-G09RevD.01
frameworkgroup: C1[X(C12H15N)]
method: RPBEPBE
basis: SDD
operation: Freq
keyword: #pfreq=noraman
keyword: PBEPBE/SDD
title: #p freq=noraman PBEPBE/SDD
converged: YES YES NO NO
title: Mulliken charges:
elementType: N C C C C C C C C C C C C H H H H H H H H H H H H H H H
charge: -0.025024 -0.377442 -0.333646 -0.567929 -0.358820 0.516280 -0.692598 -0.399914 -0.393298 -0.369826 -0.371722 0.387423 -0.258222 0.209631 0.208654 0.189897 0.188496 0.211134 0.210403 0.198140 0.197459 0.210179 0.218474 0.210515 0.241630 0.241387 0.254355 0.254384
chargesum: 0.00000
title: Mulliken charges with hydrogens summed into heavy atoms:
elementType: N C C C C C C C C C C C C
charge: -0.025024 0.040843 0.044747 -0.146392 0.036779 0.516280 -0.053430 -0.158284 -0.151911 -0.115471 -0.117338 0.387423 -0.258222
polarizability: 2.08683646e+02 2.85290950e+00 1.16257969e+02 2.16777942e+01 -2.59606760e+00 8.71202286e+01
1716.lowfreq: -10.8928 -0.0006 -0.0002 0.0006 1.0184 6.7545 23.9412 39.2754 47.9998
frequency: 23.5423 39.2053 47.9870 91.4981 109.5870 126.2825 150.6314 169.1839 235.1777 254.3506 326.1256 334.4643 400.8510 401.9464 441.7232 503.3493 545.1336 573.8270 643.0157 701.1342 726.7754 748.9788 754.8273 814.7347 836.6619 855.2465 855.5990 898.3246 953.1449 970.6448 984.0945 998.4700 1013.3448 1042.8540 1070.2400 1075.1647 1109.6050 1129.9407 1188.8412 1196.6021 1205.0027 1220.1346 1239.0269 1253.5040 1283.2092 1288.7060 1298.9575 1312.9605 1333.9586 1351.1106 1369.1859 1391.2151 1412.3021 1464.7095 1466.3294 1474.8052 1478.5668 1483.8100 1489.6354 1498.9964 1565.7624 1618.2263 2176.6627 2953.5295 2966.5261 2971.9429 2973.1614 2982.4673 2992.4909 3013.9843 3029.0613 3050.3677 3069.5867 3073.0441 3128.8893 3130.9638 3159.6194 3163.8316
redmass: 3.6902 5.6348 1.8168 2.3079 4.8441 1.9327 5.4764 4.1536 1.1069 5.8386 3.4170 2.5325 2.8687 3.5047 5.3177 5.2599 7.4844 2.9006 7.0381 4.4233 1.0680 3.7806 1.1411 4.3307 1.2248 1.2841 1.6564 1.8828 1.2255 1.4472 1.3767 3.3873 2.9889 3.2840 1.3493 2.3878 2.2868 1.2956 1.5112 1.5920 2.1807 2.1466 1.3883 1.2912 1.0847 1.1179 1.3933 1.3027 1.4187 1.6147 4.1698 1.2143 3.2385 1.0721 1.0812 1.0753 1.0424 1.0826 1.0937 2.5618 6.6251 6.2698 12.6313 1.0589 1.0592 1.0566 1.0386 1.0591 1.0982 1.1012 1.1036 1.1047 1.1008 1.0993 1.0889 1.0890 1.0958 1.0972
irintensity: 0.4221 1.1787 0.2055 0.1149 1.0801 0.3742 2.6543 0.7957 0.0002 0.8145 0.3060 0.1304 0.0137 0.5314 2.5489 0.6728 0.1804 25.3496 0.0013 0.9979 9.6190 0.7511 0.2045 5.2119 0.9747 6.7595 55.2328 1.5701 1.0019 1.5274 0.0316 1.1176 5.6174 1.5535 0.8957 0.4348 26.9081 8.6558 5.8511 0.0058 0.2843 0.1581 7.7226 0.0784 0.2581 0.8752 2.5322 0.0785 1.3283 1.0932 0.0085 10.2881 6.0584 0.0975 0.2512 2.1643 12.7119 0.5893 24.0324 25.8040 0.0027 36.3480 52.9579 11.5361 11.7641 46.3717 31.1838 81.4439 1.1686 1.8729 12.1652 59.6372 91.8344 50.9127 7.8638 14.5653 14.3389 0.0850
temp: 298.150 k
press: 1.00000 atm
elementType: 7 6 6 6 6 6 6 6 6 6 6 6 6 1 1 1 1 1 1 1 1 1 1 1 1 1 1 1
symmnumber: 1
zpe: 620140.3 jmol-1
zpe.correction: 0.236199 hartree
zpe.thermalcorrener: 0.249677 hartree
zpe.thermalcorrenthalpy: 0.250621 hartree
zpe.thermalcorrgfe: 0.194064 hartree
zpe.sumelectzpe: -520.059382 hartree
zpe.sumelectthermal: -520.045904 hartree
zpe.sumelectthermalent: -520.044960 hartree
zpe.sumelectthermalfe: -520.101518 hartree
dipole: 5.4995 0.2218 1.3282
dipole: 5.6619
quadrupole: -111.8541 -71.0526 -81.9980
quadrupole: -1.1029 -5.6541 -1.2638
quadrupole: -23.5525 17.2490 6.3035 -1.1029 -5.6541 -1.2638
hfenergy: -520.2955814 hartree
pointgroup: C01 [X(C12H15N1)]
dipole: 2.166184 0.0618667 0.5156697 debye
polarizability: 208.8853224|1.7803542|116.3687623|21.2242933|-1.8289588|86.8077591 unknown
InChI: InChI=1S/C12H15N/c1-2-3-4-5-11-6-8-12(10-13)9-7-11/h6-9H,2-5H2,1H3
charge 0 multiplicity 1
28 atoms
N  -5.376674 -0.098629 -0.900102
C  2.29019 -0.001059 -0.136778
C  3.782195 0.028569 0.261331
C  1.340826 0.140919 1.088344
C  4.735294 -0.126924 -0.945685
C  -0.12499 0.094667 0.694098
C  6.225149 -0.100449 -0.540987
C  -0.838927 1.283854 0.389052
C  -0.806911 -1.145907 0.57664
C  -2.185104 1.243266 -0.022073
C  -2.15257 -1.205249 0.167516
C  -2.855076 -0.006246 -0.137574
C  -4.232282 -0.056501 -0.55361
H  2.077885 0.813849 -0.857965
H  2.063461 -0.949947 -0.663751
H  4.006052 0.981861 0.78469
H  3.984366 -0.781776 0.993096
H  1.567392 1.094972 1.603071
H  1.56825 -0.673163 1.804192
H  4.534096 0.682605 -1.67651
H  4.509877 -1.079189 -1.467771
H  6.457305 -0.915873 0.169988
H  6.884874 -0.220859 -1.419711
H  6.486973 0.856169 -0.050724
H  -0.333177 2.252448 0.47956
H  -0.275489 -2.075046 0.814538
H  -2.725353 2.167414 -0.251222
H  -2.667832 -2.167582 0.085146
