program: Gaussian 09
title: 000264949
version: EM64L-G09RevD.01
frameworkgroup: C1[X(C12H8O2)]
method: RPBEPBE
basis: SDD
operation: Freq
keyword: #pfreq=noraman
keyword: PBEPBE/SDD
title: #p freq=noraman PBEPBE/SDD
converged: NO NO NO NO
title: Mulliken charges:
elementType: O O C C C C C C C C C C C C H H H H H H H H
charge: -0.224947 -0.225626 -0.100721 0.303027 0.260944 0.422699 -0.417858 -0.411846 -0.453526 0.161981 -0.396264 -0.434259 -0.232550 -0.235571 0.245188 0.245186 0.244795 0.244561 0.293879 0.243515 0.235157 0.232238
chargesum: 0.00000
title: Mulliken charges with hydrogens summed into heavy atoms:
elementType: O O C C C C C C C C C C C C
charge: -0.224947 -0.225626 -0.100721 0.303027 0.260944 0.422699 0.072516 -0.167051 -0.208965 0.161981 -0.102385 -0.190744 0.002606 -0.003334
polarizability: 1.89803929e+02 1.60248242e+01 1.56681531e+02 2.69223884e-03 1.04829257e-03 5.51672704e+01
1716.lowfreq: -6.0688 -0.0009 0.0004 0.0007 8.8550 12.5468 97.7017 116.9605 191.0651
frequency: 97.6543 116.9571 191.0649 193.4613 213.6935 274.9699 358.1424 403.8754 416.0650 496.1201 496.5703 508.0870 541.9714 576.6267 622.1360 645.2336 689.4311 717.4251 736.7228 763.7931 785.0581 828.7332 835.3311 895.1916 900.4130 949.3165 967.0719 984.7210 992.5084 996.7696 1006.8540 1025.9024 1060.2483 1135.8177 1150.2297 1168.4804 1179.3216 1232.8453 1237.9937 1276.8862 1307.5984 1366.6331 1404.3205 1430.3774 1435.9347 1451.1443 1461.1709 1523.8635 1585.6061 1596.5525 1638.9877 1696.4314 3007.8138 3063.3637 3123.0759 3126.4760 3138.3831 3150.1514 3155.6503 3169.2325
redmass: 5.4864 4.8877 4.4672 7.3169 3.3565 3.3373 6.6734 3.3123 6.7051 3.3108 5.9571 3.4701 5.4512 8.5104 3.6688 8.1197 7.2277 5.5083 5.9305 1.4041 2.5757 5.4210 1.4045 1.5503 7.5145 10.0648 1.3466 1.4600 4.8886 1.7302 1.3316 2.2075 4.0031 1.0766 1.3492 1.5447 1.1553 1.6672 2.4302 1.7615 1.7980 2.3372 4.7512 4.2005 3.2400 1.3640 1.6880 4.3874 8.0230 5.9142 7.2302 12.7099 1.0576 1.1065 1.0870 1.0872 1.0901 1.0976 1.0953 1.0996
irintensity: 4.5836 0.1780 4.5565 6.4317 1.3151 1.5473 0.0110 0.0080 0.6097 7.6352 0.0537 21.8115 2.0038 2.2423 1.6516 2.9376 2.0492 0.3324 0.1009 15.2471 39.3944 22.4646 74.1117 1.6413 86.0597 35.5247 0.0780 6.3739 26.5069 0.0386 0.6905 17.7233 50.6147 0.1050 6.7672 31.1445 5.2804 2.7368 10.3643 7.6312 13.7314 1.2606 3.6064 5.1434 4.3504 2.8911 14.3546 27.9412 18.9394 6.1341 8.9721 323.7910 26.3817 9.7742 1.0304 2.4032 15.3841 21.9080 14.2613 19.9328
temp: 298.150 k
press: 1.00000 atm
elementType: 8 8 6 6 6 6 6 6 6 6 6 6 6 6 1 1 1 1 1 1 1 1
symmnumber: 1
zpe: 433661.0 jmol-1
zpe.correction: 0.165173 hartree
zpe.thermalcorrener: 0.175091 hartree
zpe.thermalcorrenthalpy: 0.176036 hartree
zpe.thermalcorrgfe: 0.129731 hartree
zpe.sumelectzpe: -611.594092 hartree
zpe.sumelectthermal: -611.584173 hartree
zpe.sumelectthermalent: -611.583229 hartree
zpe.sumelectthermalfe: -611.629534 hartree
dipole: -2.4921 5.1256 0.0004
dipole: 5.6993
quadrupole: -73.7762 -77.8144 -82.9939
quadrupole: 13.0990 0.0013 -0.0010
quadrupole: 4.4186 0.3804 -4.7991 13.0990 0.0013 -0.0010
hfenergy: -611.7592649 hartree
pointgroup: C01 [X(C12H8O2)]
dipole: 0.9665296 -2.0232915 0.0001534 debye
dipolederiv: -0.9953712 -0.2884805 0.0000486 -0.1226667 -0.6172704 0.0000141 -0.000083 -0.0000548 -0.2993753 -0.561917 0.0377159 -0.0000011 0.1140264 -1.1892647 -0.0000494 -0.0000059 0.0001417 -0.3252267 -0.2931095 0.213387 -0.0000166 0.2950525 -0.4832573 0.0000111 0.0000416 -0.0000151 -0.0017145 0.1794441 0.0654198 0.0000008 -0.2807709 0.0813154 0.0000128 0.0000356 -0.0000107 -0.0570614 0.1649658 -0.0315186 -0.0000052 0.3079515 0.0207477 -0.0000048 -0.0000111 -0.0000133 0.0319167 0.0257795 0.0679909 0.0000014 -0.051712 -0.2311134 0.0000008 0.0000055 -0.0000026 0.0503675 0.1095595 -0.0558075 -0.0000152 0.0728705 0.3802918 -0.0000144 -0.0000028 -0.0000084 0.3380178 -0.3592433 0.0912963 0.0000047 0.1286106 0.1168262 0.000002 0.0000043 -0.0000004 -0.1689952 0.2037147 -0.0273033 -0.0000122 0.1081057 0.1460266 -0.000001 -0.0000104 0. -0.136095 1.4027079 0.0270108 -0.000019 -0.2834936 1.6648013 0.0000253 0.0000161 -0.000043 0.2528694 -0.1816171 -0.0571407 -0.0000033 -0.1082389 0.023722 0.0000071 0.0000028 -0.0000018 -0.1392299 0.0336687 -0.0305593 -0.0000049 -0.1309051 0.0846362 0.0000035 -0.0000017 0.0000074 -0.1753413 -0.0142086 0.0461222 -0.0000012 0.0418891 0.1848247 0.0000014 -0.0000052 0.0000024 -0.147376 0.1384496 -0.0464707 -0.0000083 -0.0432347 -0.1207851 0.0000022 -0.0000052 0. -0.1491354 0.0250972 -0.0252419 -0.0554621 -0.0273302 0.0091318 -0.0454178 -0.1045513 -0.0779136 -0.011701 0.0250831 -0.0252479 0.0554713 -0.0273243 0.0091408 0.0454184 0.1045599 0.0779259 -0.0117297 0.0367243 -0.0973487 0.0000007 -0.0628998 -0.0567934 0. -0.0000158 -0.000002 0.1616915 0.02189 0.1180164 0.0000043 0.0519064 -0.0331539 -0.0000032 0.00001 -0.0000056 0.1494959 0.1134838 0.0730167 0.0000045 0.0103877 0.0434259 -0.0000037 0.0000079 -0.0000043 0.1634431 0.0307546 0.0423637 0.0000035 0.1147882 -0.0601824 -0.0000039 0.0000003 -0.0000017 0.1569446 0.0303045 -0.0866459 0.000002 -0.0955103 -0.0663103 0.0000001 0.0000008 0.0000007 0.1570317 -0.1361604 -0.0105746 0.0000074 -0.0115022 0.0932406 -0.0000006 0.0000074 -0.000001 0.1612033 unknown
polarizability: 190.0233506|15.7949071|156.4621101|-0.0026994|-0.0010297|55.1672704 unknown
InChI: InChI=1S/C12H8O2/c13-12-11-9(7-14-12)6-5-8-3-1-2-4-10(8)11/h1-6H,7H2
charge 0 multiplicity 1
22 atoms
O  -3.149997 0.62078 0.000058
O  -1.744882 2.4914 -0.000019
C  -0.835931 0.171649 0.000148
C  -1.476509 -1.071549 0.000148
C  0.593104 0.289365 0.000093
C  1.352308 -0.946525 0.000069
C  -2.975357 -0.853594 0.000131
C  -0.735539 -2.285082 0.000126
C  0.66226 -2.208395 0.000086
C  -1.858526 1.254239 0.000217
C  1.285346 1.545278 0.000088
C  2.785786 -0.880627 0.000029
C  2.682718 1.571199 0.00005
C  3.438588 0.353309 0.000019
H  -3.475562 -1.252774 -0.900632
H  -3.47555 -1.252676 0.900947
H  -1.244717 -3.255001 0.000121
H  1.260048 -3.127892 0.000055
H  0.697113 2.46811 0.000118
H  3.359067 -1.815604 0.00001
H  3.213847 2.529375 0.000047
H  4.533185 0.400312 -0.000009
