program: Gaussian 09
title: 000264946
version: EM64L-G09RevD.01
frameworkgroup: C1[X(C8H12N2)]
method: RPBEPBE
basis: SDD
operation: Freq
keyword: #pfreq=noraman
keyword: PBEPBE/SDD
title: #p freq=noraman PBEPBE/SDD
converged: YES YES NO NO
title: Mulliken charges:
elementType: N N C C C C C C C C H H H H H H H H H H H H
charge: -0.099581 -0.009885 -0.467217 0.468009 -0.623872 -0.611798 -0.327288 -0.373906 -0.332415 -0.328065 0.230991 0.194679 0.246783 0.190325 0.225199 0.225658 0.189633 0.226963 0.268388 0.232724 0.237617 0.237058
chargesum: 0.00000
title: Mulliken charges with hydrogens summed into heavy atoms:
elementType: N N C C C C C C C C
charge: -0.099581 -0.009885 -0.041547 0.468009 0.038435 0.030457 -0.058899 -0.141182 -0.094798 -0.091008
polarizability: 1.22570157e+02 4.51125142e-01 9.73792821e+01 -6.07053192e+00 5.31556622e+00 6.44780438e+01
1716.lowfreq: -5.5982 0.0003 0.0004 0.0006 6.8435 11.1029 46.9318 79.0839 117.3624
frequency: 46.8261 79.0585 117.3369 219.0746 236.4120 238.4121 312.1115 323.1734 351.9117 371.4707 442.6691 493.4145 596.9980 661.9801 738.0061 791.8914 825.2454 832.0470 897.3857 955.7944 959.4034 979.2621 996.0653 1035.9142 1037.9779 1057.9384 1079.8927 1091.4534 1134.1128 1168.4121 1204.8004 1222.9359 1260.8863 1271.5570 1305.9092 1324.6535 1362.2400 1402.9616 1420.3699 1441.3438 1456.6786 1462.1153 1465.2514 1475.5226 1477.1505 1487.0110 1559.8711 1588.8775 2836.0834 2857.0070 2871.3479 2990.3361 3020.8624 3029.7576 3079.4432 3087.7781 3120.2868 3128.4770 3144.3605 3161.0296
redmass: 3.1359 2.9781 3.4391 2.5462 1.2408 1.1709 2.8838 2.9616 1.9786 2.5066 2.5525 3.3002 5.1307 6.9312 3.5456 2.2598 1.8438 3.7830 1.2541 1.5533 4.5967 1.6070 1.5540 1.7244 1.9158 1.9928 1.5604 1.2517 1.3881 1.8175 1.7117 1.7406 2.0696 2.3170 3.4924 1.6650 1.4109 2.0007 1.1408 1.1590 1.1528 1.0737 1.6987 1.0793 1.0579 1.0535 6.8337 5.7309 1.0702 1.0566 1.0569 1.0855 1.0730 1.0732 1.1011 1.1011 1.0872 1.0889 1.0973 1.0963
irintensity: 0.7052 0.5360 0.1817 0.2639 0.6949 0.6565 9.9779 0.1112 4.0118 0.3404 3.6319 18.5784 5.6583 0.8731 1.3270 15.6959 38.5662 24.1247 0.6841 6.0002 2.3649 3.8050 5.3865 17.2410 43.3999 7.3057 1.3016 6.5148 7.3325 2.5854 0.4263 2.2055 17.0153 2.0282 5.5975 4.1913 12.1435 22.1472 3.6784 4.8859 16.4803 10.7932 5.8549 11.4701 17.9372 10.0777 8.8118 47.6530 59.1320 69.6200 221.1592 19.0774 40.4188 34.2458 27.5594 39.6064 7.6801 22.3880 32.2899 7.3304
temp: 298.150 k
press: 1.00000 atm
elementType: 7 7 6 6 6 6 6 6 6 6 1 1 1 1 1 1 1 1 1 1 1 1
symmnumber: 1
zpe: 488007.9 jmol-1
zpe.correction: 0.185872 hartree
zpe.thermalcorrener: 0.195722 hartree
zpe.thermalcorrenthalpy: 0.196666 hartree
zpe.thermalcorrgfe: 0.150400 hartree
zpe.sumelectzpe: -420.762339 hartree
zpe.sumelectthermal: -420.752489 hartree
zpe.sumelectthermalent: -420.751545 hartree
zpe.sumelectthermalfe: -420.797811 hartree
dipole: 3.6243 1.4108 0.0299
dipole: 3.8893
quadrupole: -68.0260 -56.0266 -61.3341
quadrupole: -2.6454 -0.0400 0.5055
quadrupole: -6.2304 5.7690 0.4615 -2.6454 -0.0400 0.5055
hfenergy: -420.9482109 hartree
pointgroup: C01 [X(C8H12N2)]
dipole: -1.4319397 -0.5392753 0.0142263 debye
dipolederiv: -0.689598 -0.0515136 -0.0031209 -0.015803 -0.5026613 0.0304099 0.0884266 0.0252443 -0.5223673 -0.4098127 -0.0053453 -0.0044324 0.0104496 -0.3685874 0.0131487 -0.0254626 0.0103281 -0.2543722 0.3759314 -0.1072926 -0.1493018 -0.1515866 0.4441074 -0.0358758 -0.2935663 -0.0600021 0.1774771 0.3275149 0.0527275 0.0556758 0.0965405 0.0721434 -0.0127922 0.1364381 0.0195296 0.0091235 0.0620787 0.0609342 -0.0532989 0.10373 0.2895454 -0.0568846 -0.1295773 -0.0722747 0.4391077 0.5112965 0.1189882 0.0931706 0.1447062 0.3000617 -0.0705053 0.1623728 -0.060687 0.16366 -0.2600992 -0.2215974 0.016381 -0.1684881 -0.1494914 -0.0088233 -0.0299855 -0.0232137 -0.0993952 -0.3737711 0.1134643 -0.0264712 0.0138669 0.0355548 -0.0061774 -0.0217123 0.0014585 -0.1290783 0.2194757 0.1817849 0.0086536 0.0295384 0.3357572 -0.0448615 0.0435107 -0.020442 -0.0787278 0.2987252 -0.1790788 0.0652581 -0.0312047 0.2064258 -0.0370802 0.0438227 -0.0542898 -0.0658893 -0.0173779 -0.0270074 -0.0543448 0.0266837 0.0679842 -0.0161947 -0.0203197 -0.0474334 -0.121402 -0.0593962 -0.0094125 0.0400104 0.0564014 -0.2399836 0.0351797 0.0417189 0.1412213 0.0262405 -0.0866044 -0.0593994 -0.120361 -0.0621055 0.0746746 0.0081836 -0.1053394 0.004338 0.0460823 0.0250025 -0.0700445 0.0860999 -0.1223638 -0.1554911 0.2062849 0.0470119 0.0356115 -0.1115472 -0.0179891 0.1274143 0.0997019 0.1333073 -0.0499069 -0.0635273 0.0456713 -0.0265848 0.0417913 -0.0661196 0.0820603 0.0163053 0.1395462 -0.0587737 -0.0522733 0.0849451 -0.0719664 0.0881312 -0.1376291 -0.0712043 -0.0424291 -0.2590944 -0.1777078 0.0411039 0.0430011 0.1073469 0.0298437 0.0812177 -0.0123395 0.0324788 -0.0457406 0.0941438 -0.016976 -0.0416594 0.0050777 -0.1842006 0.0915062 0.1042163 -0.0339912 0.0926289 0.0290207 0.0114902 -0.0366635 0.0125679 0.1396118 0.0852618 -0.0859891 -0.0002917 -0.0448459 -0.0937996 0.0224212 -0.002688 0.022657 0.1475345 0.0621756 -0.0554092 0.0008803 -0.0449607 -0.1180107 0.0241681 -0.000364 0.0189744 0.1309117 -0.021789 0.1140437 -0.0265728 0.0987941 -0.0350054 0.0295816 -0.0295812 0.0325384 0.1274646 unknown
polarizability: 122.9437682|-0.4553129|98.0907767|3.7909772|-2.1695|63.3929378 unknown
InChI: InChI=1S/C8H12N2/c1-10(2)7-8-3-5-9-6-4-8/h3-6H,7H2,1-2H3
charge 0 multiplicity 1
22 atoms
N  -2.204795 0.238329 0.055643
N  2.967074 0.377693 0.004553
C  -1.247231 -0.77329 -0.439764
C  0.210515 -0.36882 -0.247638
C  -2.20784 0.348453 1.529285
C  -3.561584 0.051407 -0.494865
C  0.615863 0.985757 -0.339151
C  1.217453 -1.337879 -0.01988
C  1.984701 1.307074 -0.207739
C  2.565004 -0.925206 0.094354
H  -1.432803 -0.899435 -1.525921
H  -1.411342 -1.780395 0.025319
H  -1.189255 0.567895 1.892422
H  -2.563523 -0.584318 2.035883
H  -2.866802 1.179442 1.837112
H  -4.210498 0.882188 -0.164968
H  -4.044879 -0.906628 -0.175686
H  -3.523493 0.065608 -1.598952
H  -0.139255 1.76166 -0.500422
H  0.962488 -2.40042 0.06993
H  2.324596 2.347176 -0.27432
H  3.361806 -1.657592 0.269406
