program: Gaussian 09
title: 000264945
version: EM64L-G09RevD.01
frameworkgroup: C1[X(C8H8BrNO)]
method: RPBEPBE
basis: SDD
operation: Freq
keyword: #p
keyword: freq=noraman
keyword: PBEPBE/SDD
title: #p freq=noraman PBEPBE/SDD
converged: YES YES NO NO
title: Mulliken charges:
elementType: Br O N C C C C C C C C H H H H H H H H
charge: 0.003028 -0.289705 -0.368951 0.324550 -0.338421 -0.326030 0.188027 -0.190272 -0.228533 -0.221889 -0.612139 0.289357 0.253443 0.239292 0.240483 0.299719 0.230684 0.229009 0.278348
chargesum: 0.00000
title: Mulliken charges with hydrogens summed into heavy atoms:
elementType: Br O N C C C C C C C C
charge: 0.003028 -0.289705 -0.069232 0.324550 -0.338421 -0.036674 0.188027 0.063171 0.010759 0.018594 0.125902
polarizability: 1.47440212e+02 -1.27936543e+01 1.34830155e+02 -8.14728994e-02 -2.02187468e+00 5.05943294e+01
1716.lowfreq: -5.5644 -0.0008 -0.0007 -0.0005 2.9249 6.6349 23.6695 81.2214 93.2477
frequency: 23.6450 81.1855 93.2468 122.6718 162.6884 204.4843 250.7013 258.6369 342.6084 373.5574 427.5839 469.5409 516.1785 603.2433 628.9572 673.2672 680.4715 741.9824 778.9154 809.4587 882.5785 969.7271 980.5019 1001.2562 1003.6543 1052.1694 1110.3965 1119.8121 1140.5698 1159.9635 1173.6278 1253.2153 1270.3591 1359.9989 1410.9999 1415.6324 1445.6263 1460.7906 1488.1322 1529.1081 1557.3899 1593.5650 1601.1468 2980.5777 3059.6982 3117.3308 3140.4233 3153.5243 3165.8825 3177.2156 3521.0538
redmass: 5.0486 1.1008 3.4786 4.1484 4.4760 6.4243 4.5060 8.1015 4.6740 6.9985 3.8999 4.4887 4.8488 1.1837 6.2034 5.1097 4.9466 2.5613 1.6132 3.8678 1.3908 1.3789 5.5940 1.3813 5.5502 2.1929 1.8254 1.2954 1.7426 2.4566 1.0599 1.5647 2.1077 7.9896 1.8682 1.3153 2.2475 1.1810 1.0455 1.5541 6.1313 7.2911 6.7024 1.0352 1.1022 1.0981 1.0860 1.0902 1.0950 1.1004 1.0785
irintensity: 10.5068 0.4973 0.1899 3.6061 3.1544 0.6022 0.4868 1.6268 22.7378 5.2854 1.7761 12.7335 2.4477 124.2217 8.3188 17.4090 17.6796 37.6982 47.3777 0.3831 0.9488 2.8565 25.3956 1.5263 42.0010 3.2093 1.0059 0.0980 51.4071 1.2074 1.6876 19.1663 86.7641 5.0676 12.7230 40.3422 36.0405 59.1190 16.6094 139.6141 6.1140 88.9244 130.4059 67.7960 34.2704 1.9563 3.5627 3.8583 6.0383 17.7014 65.6161
temp: 298.150 k
press: 1.00000 atm
elementType: 35 8 7 6 6 6 6 6 6 6 6 1 1 1 1 1 1 1 1
symmnumber: 1
zpe: 374066.0 jmol-1
zpe.correction: 0.142474 hartree
zpe.thermalcorrener: 0.153228 hartree
zpe.thermalcorrenthalpy: 0.154172 hartree
zpe.thermalcorrgfe: 0.103787 hartree
zpe.sumelectzpe: -452.297584 hartree
zpe.sumelectthermal: -452.286831 hartree
zpe.sumelectthermalent: -452.285887 hartree
zpe.sumelectthermalfe: -452.336271 hartree
dipole: -1.2587 -1.8395 1.5837
dipole: 2.7342
quadrupole: -58.4536 -77.6643 -77.6039
quadrupole: -8.1794 2.4780 2.4026
quadrupole: 12.7870 -6.4237 -6.3633 -8.1794 2.4780 2.4026
hfenergy: -452.4400586 hartree
pointgroup: C01 [X(C8H8Br1N1O1)]
dipole: -0.5344322 0.2707969 -0.8934472 debye
dipolederiv: -0.2105664 -0.1857094 0.116158 -0.1345736 -0.4929947 0.2336784 0.11206 0.2283319 -0.1674088 -0.7481705 0.178166 -0.1959708 0.0131625 -0.5599176 0.3087846 0.0371823 0.2542381 -0.7778523 -0.9558538 -0.0720445 0.2443906 -0.0588295 -0.4973269 0.0639658 0.259159 0.0902842 -0.6253446 -0.4277702 -0.095285 0.0342669 0.0262743 -0.226798 0.1854383 -0.1077937 0.1812564 -0.0850428 0.2967829 0.4596286 -0.2342238 0.2260611 0.7512971 -0.4764374 -0.0603326 -0.5022136 0.1548455 -0.0101783 0.0211776 -0.0017701 0.0031422 -0.0411574 -0.0371055 -0.0333735 -0.0539484 -0.0782518 1.394985 -0.111558 -0.0260269 0.1521337 0.523889 -0.5458993 -0.2924236 -0.4547134 0.9905116 -0.244258 -0.1673432 0.0949949 -0.2098874 -0.2033118 0.0487121 0.127878 0.0641386 -0.1231819 -0.0403905 0.1261046 -0.0754673 0.0810655 -0.0055872 -0.0933992 -0.0400663 -0.0926882 -0.0948261 0.0990791 -0.043046 0.037362 0.0839211 0.0322029 -0.099001 -0.0437241 -0.1006917 -0.0777924 0.4998391 0.0438435 -0.095372 -0.0977284 0.1686643 0.1335001 0.063673 0.114679 0.0837173 0.1364322 0.0260002 -0.0174537 0.0296326 0.064107 0.0517608 0.0034171 0.0687282 0.1185285 0.0591357 0.0413213 -0.0341041 0.0621677 0.0266176 0.0839991 -0.0410228 0.0771253 0.1122871 0.0252089 -0.0734453 0.0401765 -0.0860029 0.0057426 0.0952837 0.0456149 0.0923208 0.1054667 -0.1077061 -0.0100941 -0.0059122 -0.002368 0.0968749 0.0391976 -0.0071978 0.0405811 0.1381186 0.2134447 -0.0780984 0.0105888 -0.0937326 0.3206522 0.0869847 -0.0210791 0.0630711 0.225148 -0.0725783 -0.0646694 0.0196929 -0.1355355 -0.1062991 -0.0332979 -0.0080082 -0.0281395 0.1219307 -0.0530818 0.016065 0.071454 0.0660447 0.0609419 -0.1065325 0.1157473 -0.1091895 -0.0646582 0.1456463 -0.0110134 0.0172163 0.0750526 0.0824031 0.0603674 -0.1097098 0.0668296 0.0438049 unknown
polarizability: 146.4777894|10.0563765|109.4319585|-8.7213232|-39.40541|76.9549492 unknown
InChI: InChI=1S/C8H8BrNO/c1-10-8(11)6-4-2-3-5-7(6)9/h2-5,10H,1H3
charge 0 multiplicity 1
19 atoms
Br 0.05836 2.106109 -1.465787
O  1.850267 -1.381975 1.229006
N  2.272259 -0.099812 -0.658785
C  -0.080585 -0.490428 0.070885
C  -0.799438 0.53602 -0.596898
C  -0.861444 -1.510434 0.690458
C  1.421488 -0.670138 0.263858
C  -2.210394 0.546194 -0.661057
C  -2.265978 -1.524065 0.631215
C  -2.947241 -0.491889 -0.052268
C  3.730342 -0.234863 -0.555862
H  -0.30337 -2.279662 1.234087
H  -2.726752 1.360476 -1.176756
H  -2.825196 -2.329675 1.117613
H  -4.040826 -0.480575 -0.10755
H  1.886928 0.478777 -1.407796
H  4.212012 0.753564 -0.437537
H  4.145601 -0.730933 -1.452242
H  3.949569 -0.850889 0.329917
