program: Gaussian 09
title: 000264937
version: EM64L-G09RevD.01
frameworkgroup: C1[X(C8H12N2S2)]
method: RPBEPBE
basis: SDD
operation: Freq
keyword: #p
keyword: freq=noraman
keyword: PBEPBE/SDD
title: #p freq=noraman PBEPBE/SDD
converged: NO YES NO NO
title: Mulliken charges:
elementType: S S N N C C C C C C C C H H H H H H H H H H H H
charge: 0.218195 0.271147 0.050214 0.033561 -0.567462 -0.197100 -0.574947 -0.408313 -0.169336 -0.662345 -0.662891 -0.279825 0.272250 0.272270 0.266321 0.266222 0.248842 0.231110 0.231019 0.225181 0.230890 0.231011 0.221510 0.252477
chargesum: 0.00000
title: Mulliken charges with hydrogens summed into heavy atoms:
elementType: S S N N C C C C C C C C
charge: 0.218195 0.271147 0.050214 0.033561 -0.022942 -0.197100 -0.042404 -0.408313 0.079506 0.024965 0.020521 -0.027349
polarizability: 1.80593576e+02 -1.90916421e+00 1.73540416e+02 -4.77391138e-02 1.27821253e-01 6.88576324e+01
1716.lowfreq: -11.6758 -3.1899 -0.0025 -0.0023 -0.0020 3.5809 30.3774 42.6752 54.8344
frequency: 30.3541 42.5889 54.8034 68.3878 77.0237 126.0075 150.2032 167.9681 234.4904 236.0926 240.0399 282.7013 297.4252 362.6340 419.5234 424.5457 479.8802 593.9162 623.5144 630.2561 668.7852 765.2771 776.2825 778.8279 780.4280 824.8556 924.9526 963.9063 994.1170 995.9220 1040.5108 1043.0178 1061.6727 1067.7427 1075.8109 1141.3726 1187.9834 1229.7750 1233.4724 1243.4588 1267.6804 1275.2460 1292.2163 1377.8110 1398.6416 1400.3086 1443.5068 1451.7084 1471.9790 1472.5137 1482.4559 1482.9292 1498.5631 1508.8842 2987.8265 2989.2215 3040.2159 3044.4602 3082.2608 3083.7622 3084.5945 3086.7728 3120.7179 3124.7191 3145.4943 3182.9301
redmass: 4.1879 2.3037 1.8760 3.5456 2.9401 4.1179 5.8148 11.0187 1.1247 1.1137 4.4524 3.6682 5.1856 5.7951 10.5362 3.6551 10.8010 7.0920 4.7547 4.7296 8.7269 5.8576 1.1210 9.5507 1.1322 1.3349 9.6256 1.4056 1.7945 1.7913 1.2099 1.2096 2.1121 2.2572 1.9037 3.9692 3.8764 1.2349 1.2340 10.1671 1.4123 1.3270 2.2759 1.7968 1.2067 1.2062 1.0851 1.0850 1.0390 1.0389 1.0498 1.0480 5.7882 5.1697 1.0356 1.0357 1.0586 1.0589 1.0979 1.0977 1.1015 1.1015 1.1077 1.1079 1.0908 1.0970
irintensity: 0.1240 0.0643 0.2105 0.0601 5.0288 2.3907 4.4570 0.0766 0.0328 0.1203 0.1415 0.3786 4.7230 6.5294 5.6774 2.5869 1.8963 1.4921 0.4637 5.9395 23.3331 0.4946 1.8820 72.3948 17.4670 40.2868 7.8172 0.1598 1.1882 29.1407 0.0052 0.1133 0.9443 0.3388 11.2430 87.4802 147.7317 0.0014 0.8711 7.3058 43.3997 34.0728 81.3776 210.8342 18.0143 19.3223 15.2210 10.1651 7.4116 23.2043 11.8461 10.3017 147.2864 353.0260 35.3580 32.8361 11.7092 5.6665 23.8742 23.3478 9.7321 11.4835 28.2414 28.5647 19.8254 5.9527
temp: 298.150 k
press: 1.00000 atm
elementType: 16 16 7 7 6 6 6 6 6 6 6 6 1 1 1 1 1 1 1 1 1 1 1 1
symmnumber: 1
zpe: 491294.0 jmol-1
zpe.correction: 0.187124 hartree
zpe.thermalcorrener: 0.201067 hartree
zpe.thermalcorrenthalpy: 0.202012 hartree
zpe.thermalcorrgfe: 0.144094 hartree
zpe.sumelectzpe: -1216.750531 hartree
zpe.sumelectthermal: -1216.736588 hartree
zpe.sumelectthermalent: -1216.735643 hartree
zpe.sumelectthermalfe: -1216.793561 hartree
dipole: -2.2293 -2.6725 0.0010
dipole: 3.4802
quadrupole: -91.0281 -75.2948 -88.9475
quadrupole: -6.5282 0.0110 0.0338
quadrupole: -5.9379 9.7953 -3.8574 -6.5282 0.0110 0.0338
hfenergy: -1216.937655 hartree
pointgroup: C01 [X(C8H12N2S2)]
dipole: -0.8631323 -1.0625062 -0.0294395 debye
dipolederiv: -0.5442893 -0.4047167 -0.0113274 -0.4136633 -0.4089044 -0.0079419 -0.0108769 -0.0072185 -0.1051892 -0.5163197 0.4404735 0.0166245 0.4029527 -0.2997196 -0.0090998 0.0139422 -0.0076639 -0.0803105 -1.7117161 0.0630651 0.0104703 -0.0107528 -0.3560983 -0.0091891 0.0088714 -0.0079652 -0.102561 -0.8884074 0.0539968 0.0054127 0.7475287 -0.9325183 -0.0278437 0.0292808 -0.0251612 -0.1967778 -0.0072642 -0.0011878 0.0005168 0.1395229 0.5144981 0.0128639 0.0056845 0.0136055 0.130053 1.4439381 0.5531379 0.0103184 0.5668446 0.6923551 0.0196485 0.01039 0.0190225 0.0215865 -0.0127278 -0.0169394 0.0005678 -0.1393877 0.4694945 0.0122374 -0.0040621 0.0116248 0.1257078 1.5996208 -0.6735629 -0.0296051 -0.7117998 0.8026518 0.0295477 -0.0311486 0.0292929 0.0146557 -0.5897691 -0.2791442 -0.0070659 -0.5161568 -0.6142693 -0.0138173 -0.0147935 -0.0154159 -0.1120519 0.0583519 0.0329563 0.0017991 -0.1560372 -0.1158456 -0.0048584 -0.0051689 -0.007005 0.0715529 0.0516983 -0.0241211 -0.0017249 0.1634991 -0.106366 -0.0053582 0.0048798 -0.0059065 0.0713722 0.9217841 0.1729707 0.0004528 -0.1466539 0.4876489 0.0184722 -0.0106696 0.016178 -0.0316623 0.0109761 0.0430609 0.0963184 -0.0219276 -0.0513105 -0.0158387 0.0957659 -0.0040188 -0.026457 0.0071854 0.0498981 -0.0934732 -0.0141141 -0.0517551 0.013761 -0.0977068 0.0008178 -0.0207807 0.0027274 -0.0494309 0.0987146 0.010765 -0.0521833 0.0184328 0.1016869 0.0105864 -0.0286222 0.0035417 -0.0428138 -0.1020868 0.0185314 -0.0513618 -0.0206424 -0.10058 -0.0126485 -0.0323988 -0.0207971 0.0928956 0.0044018 0.054615 0.0848156 -0.0034782 0.0030102 -0.0036699 0.1759644 0.0065187 -0.0288646 0.0938653 0.054018 0.117979 -0.047498 0.1212137 -0.0024166 -0.0648558 0.0008661 -0.0223518 -0.0973556 0.0634764 0.1137432 0.0583607 -0.1188993 0.0150023 -0.0552649 0.0464533 0.036335 0.0020725 -0.0105482 -0.1715041 -0.0101829 0.0005474 -0.0103488 0.1209268 0.0020679 0.0202236 0.0976712 -0.0647138 0.1120773 0.0592027 0.1211632 0.0144188 -0.0579414 0.0049412 0.0258527 -0.0952948 -0.0568493 0.1160298 -0.0485957 -0.1239798 -0.0035379 -0.0640761 0.04666 -0.0367091 -0.0013161 0.0159152 -0.1809357 -0.0096954 0.0001986 -0.009321 0.1196236 0.0839596 -0.0050241 0.0000438 0.0249356 -0.1185212 -0.008487 0.001251 -0.0082514 0.1275067 unknown
polarizability: 180.6397191|-1.795427|173.3760039|-0.6374546|3.4738056|68.9759015 unknown
InChI: InChI=1S/C8H12N2S2/c1-3-11-7-5-6-9-8(10-7)12-4-2/h5-6H,3-4H2,1-2H3
charge 0 multiplicity 1
24 atoms
S  -2.724815 0.015469 -0.15276
S  2.771928 0.061946 -0.181344
N  0.023289 0.203923 -0.164671
N  1.282776 2.292314 -0.100741
C  -2.136606 -1.790967 -0.220645
C  -1.141694 0.906537 -0.132989
C  2.202476 -1.749694 -0.239209
C  1.180199 0.93173 -0.147556
C  -1.159015 2.326014 -0.084355
C  -3.370628 -2.702335 -0.235824
C  3.447912 -2.646772 -0.259305
C  0.094987 2.96948 -0.07017
H  -1.520443 -1.897687 -1.126885
H  -1.498178 -1.957623 0.660759
H  1.572814 -1.925473 0.647012
H  1.582631 -1.871658 -1.141284
H  -2.092775 2.891964 -0.058892
H  -3.98495 -2.570481 0.672212
H  -4.007797 -2.50994 -1.116912
H  -3.047047 -3.758604 -0.275712
H  4.077064 -2.447865 -1.144864
H  4.0667 -2.501809 0.643825
H  3.140248 -3.708106 -0.29315
H  0.168419 4.061539 -0.03364
