program: Gaussian 09
title: 000264983
version: EM64L-G09RevD.01
frameworkgroup: C1[X(C22H22ClNO)]
method: RPBEPBE
basis: SDD
operation: Freq
keyword: #p
keyword: freq=noraman
keyword: PBEPBE/SDD
title: #p freq=noraman PBEPBE/SDD
converged: YES YES NO NO
title: Mulliken charges:
elementType: Cl O N C C C C C C C C C C C C C C C C C C C C C C H H H H H H H H H H H H H H H H H H H H H H
charge: -0.074248 -0.462227 -0.121644 -0.078662 0.291184 0.255976 0.222650 0.387748 -0.487104 -0.306929 -0.362391 -0.358393 -0.417047 -0.379872 -0.392092 -0.160351 -0.272470 -0.249460 -0.233879 -0.243594 -0.239285 -0.634962 -0.622942 -0.235035 -0.245180 0.270361 0.233260 0.286197 0.292842 0.261411 0.242692 0.287171 0.266582 0.354742 0.253340 0.229174 0.225906 0.232232 0.229820 0.246309 0.217376 0.193834 0.227878 0.188446 0.219886 0.231640 0.229108
chargesum: 0.00000
title: Mulliken charges with hydrogens summed into heavy atoms:
elementType: Cl O N C C C C C C C C C C C C C C C C C C C C C C
charge: -0.074248 -0.107485 -0.121644 -0.078662 0.291184 0.255976 0.222650 0.387748 0.016517 -0.020731 -0.069549 -0.096982 -0.174355 -0.092701 -0.125510 -0.160351 -0.019130 -0.020286 -0.007973 -0.011362 -0.009465 0.022558 0.013269 -0.003395 -0.016072
polarizability: 2.79130849e+02 -2.05190545e+01 2.68570374e+02 2.31210358e+00 -4.28180010e+00 2.04942218e+02
1716.lowfreq: -6.8056 -4.3283 -0.0015 -0.0002 0.0017 2.7137 21.7791 36.5527 42.5588
frequency: 21.6913 36.4942 42.5255 51.4361 53.5333 58.3155 67.7630 85.8605 90.6334 136.9426 159.6947 191.4734 206.2222 218.5760 221.8463 233.7986 245.7956 253.2373 278.9583 284.0942 293.3733 310.9930 334.8479 347.9890 357.9601 392.3577 401.8973 407.0254 415.9404 436.9657 469.6449 495.2168 517.5231 544.3841 592.5319 614.8272 615.7677 635.2769 638.5283 651.3859 701.3595 705.8182 710.9595 728.2096 763.0114 768.4994 803.4805 828.0502 843.5224 858.8399 863.8567 878.2997 891.8291 915.8851 932.7087 942.6741 951.8487 969.7555 982.9701 988.4768 989.8540 991.2011 998.1004 1002.8931 1008.6440 1027.8545 1028.9200 1030.6258 1037.4104 1081.3631 1086.6788 1088.9508 1089.7595 1092.1717 1137.4160 1148.4397 1162.1548 1172.4319 1173.4002 1174.1770 1189.1995 1195.4231 1197.5009 1206.6844 1251.7792 1265.5214 1285.0561 1302.1681 1315.1140 1322.0784 1337.7985 1374.1039 1377.5585 1379.4656 1392.7801 1418.2764 1432.3636 1434.5015 1437.6245 1457.1070 1459.1090 1466.1293 1476.2194 1477.9574 1479.0071 1480.2875 1487.1112 1568.8948 1587.6849 1590.3369 1597.7127 1607.6726 1610.6182 2853.9540 2871.5184 2948.5344 3004.8771 3015.3369 3024.2337 3074.8895 3083.5556 3123.2258 3126.7870 3129.9431 3135.9833 3136.4228 3142.6238 3149.2420 3152.7651 3158.5848 3165.2864 3167.3677 3168.9589 3172.9731 3539.5369
redmass: 5.5250 3.8475 4.1956 3.6893 3.3047 4.3245 4.6622 3.8731 4.7378 4.4327 6.2943 5.1779 2.8062 2.1837 1.3181 1.1797 3.5126 4.0192 4.4817 2.3170 3.8384 4.3024 3.3805 4.3429 2.3032 3.3714 2.8343 2.8394 2.8994 4.0890 3.6425 3.9868 3.9698 4.2711 5.2496 6.3713 6.3729 6.0740 5.6936 5.8042 5.9359 1.7488 1.8033 4.0707 2.1578 1.8702 4.1611 3.7280 1.3794 1.2508 1.2535 1.9959 2.0893 3.1965 2.0644 1.8546 2.6896 1.7029 1.4091 2.4170 5.6663 2.0974 1.3179 1.3146 1.4437 2.3324 2.2963 2.1633 1.5434 2.1662 1.7139 1.4371 1.6422 1.7597 1.4336 1.5964 2.8007 1.0719 1.8398 1.0876 1.2022 1.1581 2.1358 3.5565 1.5209 2.1906 1.7408 1.4869 1.3500 1.3451 2.1383 3.9012 8.1885 6.9497 2.2387 1.1402 2.1902 2.2212 1.1796 1.7289 1.0487 1.2774 1.0823 1.4483 2.0334 1.5789 1.0596 7.6359 6.0472 6.1794 7.0003 6.0133 6.0564 1.0564 1.0556 1.0595 1.0987 1.0726 1.0741 1.1010 1.1008 1.0846 1.0849 1.0877 1.0883 1.0890 1.0926 1.0930 1.0950 1.0955 1.1010 1.0951 1.1002 1.0917 1.0661
irintensity: 0.5518 0.1199 0.2299 0.0497 0.5109 0.1449 1.1903 0.9550 0.7258 0.0837 0.7765 8.2198 0.3663 68.8481 0.9027 1.9704 7.0174 8.9430 3.5555 25.5356 7.3597 8.4733 3.3265 1.1106 12.2152 9.0151 0.0454 1.2209 2.5241 1.9355 3.8591 3.2422 5.2203 10.4667 5.2914 0.2803 0.1045 8.8297 17.4247 34.0887 13.3950 58.6701 38.7705 17.7906 44.2411 47.2610 22.4587 7.4857 40.3864 0.6657 0.1523 33.4670 4.3246 0.7529 18.1150 3.6174 14.0968 7.5602 0.0494 0.6525 0.6451 1.8857 0.3111 0.0623 5.4856 4.9523 68.0637 20.5786 18.1031 10.9082 1.8777 3.5014 1.3326 21.2032 10.2601 51.4976 3.8995 0.4866 3.4033 0.2947 9.0380 7.6209 11.0627 15.4864 9.5417 0.9622 75.7272 7.6842 2.6084 1.5169 6.6556 4.8321 1.0411 4.2729 15.7136 4.2949 16.3532 13.1067 3.9352 70.9634 15.1249 32.1484 15.6771 1.5629 12.9749 16.6918 14.1580 11.1967 0.7508 0.7565 13.9658 5.5400 0.9562 95.3890 157.1261 25.4030 10.0163 41.7742 41.6763 29.4093 49.6591 1.5772 0.4704 2.1889 6.9293 2.2520 18.8665 19.1705 24.5000 18.7475 25.3705 5.4666 18.2308 1.8482 10.7919
temp: 298.150 k
press: 1.00000 atm
elementType: 17 8 7 6 6 6 6 6 6 6 6 6 6 6 6 6 6 6 6 6 6 6 6 6 6 1 1 1 1 1 1 1 1 1 1 1 1 1 1 1 1 1 1 1 1 1 1
symmnumber: 1
zpe: 991544.4 jmol-1
zpe.correction: 0.377659 hartree
zpe.thermalcorrener: 0.401136 hartree
zpe.thermalcorrenthalpy: 0.402081 hartree
zpe.thermalcorrgfe: 0.323590 hartree
zpe.sumelectzpe: -1439.760884 hartree
zpe.sumelectthermal: -1439.737407 hartree
zpe.sumelectthermalent: -1439.736462 hartree
zpe.sumelectthermalfe: -1439.814953 hartree
dipole: -0.2937 -3.4941 -0.9760
dipole: 3.6397
quadrupole: -141.4690 -154.6317 -147.7603
quadrupole: 2.4971 3.1768 -5.3022
quadrupole: 6.4847 -6.6781 0.1934 2.4971 3.1768 -5.3022
hfenergy: -1440.138543 hartree
pointgroup: C01 [X(C22H22Cl1N1O1)]
dipole: -0.9047909 -1.0022416 -0.4769009 debye
polarizability: 256.089646|-11.511406|291.2036006|-4.1458446|6.5293456|205.3501944 unknown
InChI: InChI=1S/C22H22ClNO/c1-24(2)16-17-13-14-20(23)15-21(17)22(25,18-9-5-3-6-10-18)19-11-7-4-8-12-19/h3-15,25H,16H2,1-2H3
charge 0 multiplicity 1
47 atoms
Cl 1.588282 4.230496 1.907096
O  -0.377978 -0.264976 -2.032558
N  3.498018 -1.595894 -1.194193
C  -0.642909 0.06289 -0.592551
C  0.656645 0.733992 -0.072503
C  1.927271 0.08236 -0.173002
C  -1.866606 1.010902 -0.584846
C  -0.927483 -1.235983 0.199499
C  2.106439 -1.326086 -0.75196
C  0.576787 1.993465 0.573291
C  3.070076 0.735642 0.348677
C  -2.986601 0.822918 0.260311
C  -1.404565 -2.395933 -0.455862
C  -1.877736 2.101964 -1.499706
C  -0.756448 -1.269847 1.606924
C  1.736584 2.602392 1.082387
C  2.998355 1.997351 0.976505
C  -4.0945 1.699613 0.192642
C  -1.709115 -3.56512 0.277166
C  -2.982364 2.976061 -1.566739
C  -1.058273 -2.437865 2.342383
C  3.815157 -0.93498 -2.478229
C  3.810276 -3.037983 -1.22183
C  -4.098841 2.777151 -0.719926
C  -1.539328 -3.591332 1.680534
H  1.373492 -1.491359 -1.569327
H  1.862958 -2.055666 0.046363
H  -0.385089 2.500232 0.677886
H  4.02693 0.211183 0.250552
H  -3.001341 -0.010885 0.9683
H  -1.511161 -2.39394 -1.545215
H  -1.007827 2.264988 -2.145097
H  -0.374786 -0.384531 2.127873
H  -1.245348 -0.229318 -2.512629
H  3.892859 2.484391 1.375362
H  -4.953682 1.536364 0.852713
H  -2.073084 -4.45577 -0.247678
H  -2.970807 3.812973 -2.273864
H  -0.915238 -2.446639 3.428815
H  3.62598 0.149268 -2.396671
H  4.883316 -1.082537 -2.719732
H  3.20472 -1.32542 -3.330617
H  3.641121 -3.477074 -0.222308
H  3.197874 -3.614825 -1.960905
H  4.874785 -3.179471 -1.483311
H  -4.958242 3.454854 -0.770808
H  -1.772167 -4.498614 2.249088
