program: Gaussian 09
title: 000264956
version: EM64L-G09RevD.01
frameworkgroup: C1[X(C14H17N)]
method: RPBEPBE
basis: SDD
operation: Freq
keyword: #pfreq=noraman
keyword: PBEPBE/SDD
title: #p freq=noraman PBEPBE/SDD
converged: YES YES NO NO
title: Mulliken charges:
elementType: N C C C C C C C C C C C C C C H H H H H H H H H H H H H H H H H
charge: -0.079968 0.244669 -0.572230 0.155613 0.286933 0.424373 -0.440495 -0.481090 -0.360980 -0.856154 -0.445089 -0.625973 -0.615443 -0.266879 -0.246189 0.230956 0.223906 0.227339 0.235222 0.281796 0.230964 0.237999 0.235218 0.236682 0.178088 0.221983 0.253754 0.223642 0.226607 0.187031 0.222644 0.225070
chargesum: 0.00000
title: Mulliken charges with hydrogens summed into heavy atoms:
elementType: N C C C C C C C C C C C C C C
charge: -0.079968 0.244669 -0.117368 0.155613 0.286933 0.424373 -0.213156 -0.245868 -0.079184 -0.151973 -0.208407 0.027853 0.021837 -0.044236 -0.021119
polarizability: 1.97416620e+02 1.66544787e+01 1.93790910e+02 -1.08958730e+01 5.62751670e+00 9.12773925e+01
1716.lowfreq: -10.2981 -0.0009 -0.0002 0.0004 4.6924 10.8421 52.0365 66.9308 76.4573
frequency: 51.9959 66.9226 76.4461 115.7234 154.5854 168.0006 221.4196 229.9622 263.4126 267.8417 298.2972 316.2592 321.4634 367.1255 412.3655 426.5318 432.2776 493.9627 511.3363 514.7805 549.2973 606.7932 658.9964 702.4825 723.0189 753.1092 789.1717 814.1814 827.5082 856.1491 879.2458 894.8405 954.4586 973.3027 985.1985 988.8686 1010.7973 1021.1574 1035.7596 1040.5538 1043.3498 1076.1135 1092.0722 1135.9879 1155.2570 1169.0964 1174.3425 1191.0829 1236.0728 1241.8660 1254.9157 1268.8377 1278.5538 1357.2497 1363.2174 1399.7017 1408.0853 1414.4705 1417.1707 1429.5217 1439.6411 1458.2797 1462.5681 1468.9463 1473.7009 1475.0598 1478.0505 1485.9715 1494.6565 1515.9503 1578.2699 1603.0978 1632.2077 2840.2697 2852.1411 2888.9538 2976.9487 2983.3425 3013.9018 3026.5812 3055.0541 3074.4460 3080.4814 3087.6203 3115.0389 3117.6634 3130.8092 3140.7215 3151.7828 3168.1745
redmass: 2.7551 3.5684 3.3143 3.4376 2.5528 1.1637 1.4326 2.3089 1.2779 2.0985 2.8858 2.7240 3.1647 2.1192 2.7121 4.9972 2.5022 3.2129 3.3053 5.2211 3.6136 4.4945 3.7591 5.2218 4.3854 1.2858 3.1289 3.0225 1.3774 4.3460 2.0016 2.7886 1.3516 1.3962 1.5450 1.3626 2.5339 2.3652 1.5238 1.8108 1.7120 2.3428 1.2950 1.4140 1.3755 1.5118 1.3553 1.5668 1.7885 2.8737 2.3808 1.5730 1.7673 2.6753 1.4271 1.2821 2.7821 3.0389 1.1654 3.9661 1.1781 1.1070 1.5483 1.3242 1.0667 1.0637 1.1050 1.0524 1.0834 3.3939 7.0997 6.0068 6.7242 1.0574 1.0578 1.0679 1.0385 1.0875 1.0716 1.0718 1.0967 1.1010 1.0986 1.1008 1.0862 1.0858 1.0900 1.0976 1.0962 1.0974
irintensity: 0.4177 0.2741 0.6976 1.7574 0.1395 0.5246 0.1475 2.0060 0.9837 0.6428 1.7209 6.0418 3.7530 3.4871 3.9395 0.2914 2.5550 2.5576 0.7458 1.2356 8.2259 3.4369 2.1467 3.1480 3.7484 35.4236 10.4098 17.3735 65.1435 0.4109 4.5310 3.4523 0.7913 3.1318 3.5283 1.3038 35.3792 12.3254 11.6449 9.6813 17.5366 1.3472 6.2937 3.2902 0.3776 2.2831 8.1585 7.6202 2.1840 3.9122 4.4799 7.6561 5.9563 4.9473 14.6843 7.8841 1.5519 3.4719 4.5199 2.4073 2.5036 20.8576 5.0772 2.3013 11.4507 17.4949 9.7862 15.9057 5.6921 21.5192 0.8825 4.6745 3.4761 68.3180 182.0955 116.9266 36.6173 27.9197 39.9910 35.8383 18.6728 31.3555 24.9384 32.6754 6.2464 1.2810 17.1564 39.9218 30.7709 20.3181
temp: 298.150 k
press: 1.00000 atm
elementType: 7 6 6 6 6 6 6 6 6 6 6 6 6 6 6 1 1 1 1 1 1 1 1 1 1 1 1 1 1 1 1 1
symmnumber: 1
zpe: 712692.6 jmol-1
zpe.correction: 0.271450 hartree
zpe.thermalcorrener: 0.285547 hartree
zpe.thermalcorrenthalpy: 0.286491 hartree
zpe.thermalcorrgfe: 0.231031 hartree
zpe.sumelectzpe: -597.336187 hartree
zpe.sumelectthermal: -597.322090 hartree
zpe.sumelectthermalent: -597.321146 hartree
zpe.sumelectthermalfe: -597.376607 hartree
dipole: 1.4337 0.5701 -0.1140
dipole: 1.5471
quadrupole: -80.4390 -83.0823 -93.5053
quadrupole: -0.4585 -2.2669 1.6355
quadrupole: 5.2366 2.5932 -7.8298 -0.4585 -2.2669 1.6355
hfenergy: -597.6076378 hartree
pointgroup: C01 [X(C14H17N1)]
dipole: 0.5710179 -0.2107838 -0.0019114 debye
polarizability: 199.1930268|-16.1818542|192.4612244|2.6312179|10.2072354|90.8306716 unknown
InChI: InChI=1S/C14H17N/c1-11-8-9-12-6-4-5-7-13(12)14(11)10-15(2)3/h4-9H,10H2,1-3H3
charge 0 multiplicity 1
32 atoms
N  2.321392 1.250257 -0.357693
C  0.60715 -0.49193 0.312414
C  1.892652 0.250926 0.663063
C  -0.643124 0.237569 0.257219
C  0.613709 -1.887799 0.100197
C  -1.882232 -0.472936 0.008787
C  -0.624597 -2.568007 -0.159147
C  -1.839204 -1.888374 -0.19906
C  -0.709026 1.661056 0.448331
C  1.887289 -2.723929 0.13959
C  -3.12236 0.247366 -0.020323
C  2.541755 0.6625 -1.693388
C  3.488001 2.023987 0.110043
C  -1.931679 2.336829 0.417786
C  -3.15235 1.627267 0.185243
H  1.740799 0.809702 1.609017
H  2.709067 -0.484417 0.861427
H  -0.600608 -3.651999 -0.322736
H  -2.774077 -2.429179 -0.389715
H  0.225319 2.215868 0.568487
H  1.666237 -3.773038 -0.121327
H  2.649253 -2.355982 -0.5716
H  2.353041 -2.72483 1.143336
H  -4.049475 -0.308391 -0.206922
H  3.388946 -0.07124 -1.717439
H  2.767276 1.467195 -2.415846
H  1.627018 0.145301 -2.028404
H  3.249537 2.519334 1.069194
H  3.73464 2.807175 -0.628776
H  4.403844 1.396885 0.266082
H  -1.958795 3.422841 0.562754
H  -4.103397 2.171094 0.163109
