program: Gaussian 09
title: 000264985
version: EM64L-G09RevD.01
frameworkgroup: C1[X(C24H27NO)]
method: RPBEPBE
basis: SDD
operation: Freq
keyword: #p
keyword: freq=noraman
keyword: PBEPBE/SDD
title: #p freq=noraman PBEPBE/SDD
converged: YES YES NO NO
title: Mulliken charges:
elementType: O N C C C C C C C C C C C C C C C C C C C C C C C C H H H H H H H H H H H H H H H H H H H H H H H H H H H
charge: -0.456454 -0.091417 0.023428 -0.728404 0.472804 0.397014 0.375862 0.073164 0.409435 -0.430385 -0.553367 -0.468848 -0.888674 -0.408774 -0.358863 -0.384328 -0.409207 -0.257167 -0.237189 -0.231917 -0.224602 -0.253352 -0.246669 -0.240559 -0.621435 -0.614851 0.224759 0.227701 0.248945 0.214376 0.201380 0.351297 0.235581 0.211209 0.227867 0.292118 0.245515 0.269969 0.282575 0.252492 0.224430 0.222696 0.226424 0.222907 0.224973 0.224718 0.228810 0.253976 0.183269 0.218884 0.224224 0.189978 0.223681
chargesum: 0.00000
title: Mulliken charges with hydrogens summed into heavy atoms:
elementType: O N C C C C C C C C C C C C C C C C C C C C C C C C
charge: -0.105157 -0.091417 0.023428 -0.275944 0.472804 0.397014 0.375862 0.073164 0.409435 -0.181440 -0.137611 -0.233266 -0.157480 -0.163259 -0.088895 -0.101754 -0.156714 -0.032737 -0.014492 -0.005493 -0.001695 -0.028379 -0.021951 -0.011749 0.034694 0.023032
polarizability: 3.07311137e+02 -1.53689766e+01 2.75230142e+02 -2.20970701e+01 1.26911944e+00 2.06107545e+02
1716.lowfreq: -10.8582 -8.3376 -0.0005 -0.0004 0.0004 7.1635 20.6500 28.9892 34.4066
frequency: 20.1222 28.9618 34.2950 38.5972 42.6741 55.0664 59.8251 77.3785 90.5220 126.7287 139.6794 179.4671 194.9176 211.0654 220.5758 229.0447 240.4346 249.2796 264.9910 285.1358 292.5897 304.0551 316.4440 326.0200 350.5506 357.5829 399.6716 402.2697 404.8868 426.5404 433.5588 458.1486 477.0462 504.4822 510.8218 542.1066 554.5764 589.3595 612.4466 615.6808 616.7128 637.4198 696.5532 704.5462 705.6609 717.0702 738.1783 763.4675 774.2182 789.3341 816.6535 825.5963 845.5352 854.1387 858.6073 893.2428 913.9931 920.4314 927.0822 948.2071 964.8016 977.4017 978.4467 981.2368 986.6086 989.7853 990.8610 997.4847 997.8129 1016.3496 1020.9598 1028.6241 1031.5521 1034.6882 1044.7116 1076.1456 1082.8343 1086.7780 1088.9800 1096.3153 1133.2893 1150.8584 1162.1823 1167.9729 1171.0013 1172.0668 1180.9120 1189.2305 1191.3722 1193.2955 1205.5015 1243.1587 1257.3215 1260.6560 1279.7912 1300.0118 1312.2588 1319.5649 1339.7133 1356.0083 1376.6722 1379.1283 1382.9130 1387.1651 1416.1655 1433.1580 1435.1663 1439.7940 1451.3076 1451.9661 1458.4917 1465.1420 1469.8422 1473.7271 1475.9595 1479.8602 1480.7156 1483.4677 1486.3071 1506.6593 1588.2930 1592.1259 1596.5099 1605.0458 1608.8398 1613.0676 2842.3803 2846.3500 2862.9519 2958.4794 2993.4106 2998.3567 3014.9021 3028.3462 3040.2694 3048.3124 3074.4095 3077.1548 3091.7065 3112.1361 3117.6840 3122.5995 3124.2779 3126.7586 3131.6271 3139.9315 3145.6095 3153.2066 3153.9214 3157.3083 3165.5232 3180.4606 3569.5517
redmass: 4.6901 3.8714 3.1211 3.9062 4.1545 4.7153 3.2826 3.8098 4.0039 4.1086 4.3146 3.5081 1.1473 2.8953 1.3505 2.1332 2.8994 1.5125 3.7363 4.5190 2.8234 1.8506 1.9175 3.4538 2.9380 2.0544 2.8127 2.8539 2.7978 2.9190 3.0805 2.3133 3.4172 4.3626 3.1160 3.9309 4.7792 4.4481 4.4230 6.3895 6.3905 5.1739 5.3420 1.7735 1.7264 4.0445 2.1194 1.8551 1.9182 2.2934 4.2844 2.9835 3.0004 1.2499 1.2549 2.6240 1.5189 1.5064 1.5021 2.5888 1.6582 1.4742 1.4135 1.4196 1.9079 5.7155 5.5859 1.3474 1.3468 2.3030 3.6633 2.1394 2.4222 1.5423 1.5569 1.7919 1.7084 1.7790 1.3466 1.7951 1.3882 2.0483 1.7919 1.3781 1.0551 1.0655 1.1743 1.1565 2.0572 1.4620 2.6126 1.8926 2.5967 1.8866 1.5667 1.5198 1.3896 1.3391 1.7068 1.5128 4.1846 7.2283 8.0302 1.2468 1.1424 2.2126 2.2274 1.2017 2.3904 1.8018 1.0493 1.1561 1.2916 1.1523 1.0866 1.4677 1.6135 1.6106 1.0576 1.0949 6.0016 6.3302 6.4655 6.0801 6.0171 6.0434 1.0679 1.0579 1.0589 1.0398 1.0591 1.0868 1.0720 1.0730 1.0948 1.1011 1.1010 1.0973 1.1002 1.0872 1.0849 1.0845 1.0906 1.0881 1.0880 1.0938 1.0924 1.0991 1.0955 1.0992 1.1010 1.0951 1.0655
irintensity: 0.2967 0.0754 0.7808 0.0476 0.1469 0.0456 0.5015 0.4866 0.1101 0.4302 0.4763 4.6979 8.1816 0.1540 0.6000 1.5122 3.6890 0.7105 4.7697 5.2764 5.0115 121.2527 91.5266 0.5513 57.5416 21.9508 1.8551 0.5961 0.9118 6.4139 0.9787 1.3897 3.4289 0.1269 0.6922 4.6437 14.7425 8.7474 25.7446 0.7322 0.5282 16.3004 1.4923 50.8850 60.8129 3.5093 35.9892 51.7610 24.9339 32.0174 10.8246 26.1854 7.9193 0.3023 0.0766 13.1343 4.7190 8.1505 1.2798 5.9584 8.8137 3.3847 0.6617 0.1943 10.9124 0.5990 0.4041 1.9509 0.9388 70.7997 21.5832 11.1798 3.8483 12.4881 9.4053 8.3430 3.3067 6.0073 13.7692 8.8384 4.4397 25.7349 1.1919 12.5958 0.1755 0.7080 1.1007 5.5222 16.7017 0.9225 1.5109 3.2147 5.1950 0.8806 10.8088 9.8321 0.9899 0.9228 21.0330 18.5039 1.7497 0.9279 2.1845 14.8709 3.8861 8.5522 19.1711 4.6297 2.4017 19.9407 14.7393 3.8787 0.1453 24.5329 3.9854 3.2945 24.3894 5.0186 20.8415 17.3271 2.5152 0.4541 2.0957 1.2711 7.3337 2.8208 44.3825 69.0863 285.0737 35.0135 29.4111 24.4852 41.3624 34.1587 16.8529 18.4396 33.5886 17.2923 32.6287 6.8854 2.3788 1.8506 21.7170 4.2923 6.9775 32.3454 30.2488 25.5968 24.5843 35.0941 19.9371 5.0467 6.5500
temp: 298.150 k
press: 1.00000 atm
elementType: 8 7 6 6 6 6 6 6 6 6 6 6 6 6 6 6 6 6 6 6 6 6 6 6 6 6 1 1 1 1 1 1 1 1 1 1 1 1 1 1 1 1 1 1 1 1 1 1 1 1 1 1 1
symmnumber: 1
zpe: 1163296.0 jmol-1
zpe.correction: 0.443076 hartree
zpe.thermalcorrener: 0.467854 hartree
zpe.thermalcorrenthalpy: 0.468798 hartree
zpe.thermalcorrgfe: 0.387051 hartree
zpe.sumelectzpe: -1058.823893 hartree
zpe.sumelectthermal: -1058.799115 hartree
zpe.sumelectthermalent: -1058.798171 hartree
zpe.sumelectthermalfe: -1058.879918 hartree
dipole: -0.8328 -1.1031 -0.6185
dipole: 1.5142
quadrupole: -139.7689 -145.9473 -150.9521
quadrupole: -2.9726 -6.5213 -0.6669
quadrupole: 5.7872 -0.3912 -5.3960 -2.9726 -6.5213 -0.6669
hfenergy: -1059.2669694 hartree
pointgroup: C01 [X(C24H27N1O1)]
dipole: -0.3148916 0.4491569 0.2323888 debye
polarizability: 307.2969697|14.0217996|273.9503988|24.8518125|0.331815|207.4014562 unknown
InChI: InChI=1S/C24H27NO/c1-19-20(11-10-12-21(19)18-25(2)3)17-24(26,22-13-6-4-7-14-22)23-15-8-5-9-16-23/h4-16,26H,17-18H2,1-3H3
charge 0 multiplicity 1
53 atoms
O  0.800487 0.605665 -1.508984
N  -5.205803 1.421739 -0.263056
C  1.3593 0.287545 -0.171271
C  0.256788 0.511185 0.929607
C  -1.070781 -0.190787 0.674976
C  1.764995 -1.19581 -0.232278
C  2.596087 1.18682 0.061525
C  -2.148369 0.422973 -0.034218
C  -3.366126 -0.306577 -0.217241
C  -1.233099 -1.505063 1.188471
C  -4.542572 0.295058 -0.979306
C  -3.490477 -1.619613 0.293584
C  -2.053516 1.822829 -0.623119
C  2.645392 -1.727558 0.743471
C  3.532416 1.313412 -0.999813
C  1.235831 -2.055423 -1.22356
C  2.848106 1.879535 1.271748
C  -2.42846 -2.22366 0.999341
C  2.985504 -3.097938 0.733798
C  4.684246 2.113584 -0.857362
C  1.583775 -3.425431 -1.239033
C  4.0035 2.683515 1.416812
C  2.45558 -3.954063 -0.260197
C  4.925338 2.804892 0.354546
C  -5.806347 1.011972 1.022589
C  -6.174683 2.121892 -1.130655
H  0.109797 1.602033 1.039443
H  0.671776 0.148356 1.888239
H  -0.401897 -1.967509 1.733452
H  -4.197607 0.696238 -1.952724
H  -5.276526 -0.519795 -1.209703
H  0.545484 1.562838 -1.512061
H  -4.429689 -2.165719 0.139853
H  -1.249679 2.425524 -0.167556
H  -1.860239 1.774212 -1.71402
H  -3.010376 2.354113 -0.475316
H  3.082452 -1.06657 1.501724
H  3.340204 0.775903 -1.93431
H  0.559014 -1.640479 -1.974459
H  2.150393 1.804006 2.111867
H  -2.531015 -3.239507 1.39603
H  3.670244 -3.494266 1.492428
H  5.395026 2.198263 -1.687279
H  1.168242 -4.080112 -2.013709
H  4.180775 3.213169 2.359873
H  2.723217 -5.016844 -0.273027
H  5.819788 3.427708 0.467806
H  -5.037886 0.550394 1.664286
H  -6.642833 0.276619 0.899201
H  -6.205649 1.901114 1.542769
H  -6.594632 2.990699 -0.592859
H  -7.028979 1.47417 -1.456063
H  -5.664918 2.493251 -2.038364
