program: Gaussian 09
title: 000264989
version: EM64L-G09RevD.01
frameworkgroup: C1[X(C27H25N)]
method: RPBEPBE
basis: SDD
operation: Freq
keyword: #pfreq=noraman
keyword: PBEPBE/SDD
title: #p freq=noraman PBEPBE/SDD
converged: YES YES NO NO
title: Mulliken charges:
elementType: N C C C C C C C C C C C C C C C C C C C C C C C C C C C H H H H H H H H H H H H H H H H H H H H H H H H H
charge: -0.095604 0.211630 0.158340 -0.547796 0.244399 0.397797 -0.419687 -0.513480 -0.498490 -0.345195 0.314397 -0.443487 -0.269715 0.278739 0.257716 -0.626896 -0.623910 -0.249474 -0.389087 -0.409330 -0.412641 -0.406387 -0.233769 -0.237020 -0.240172 -0.236085 -0.247106 -0.249017 0.232719 0.230534 0.245623 0.226789 0.236316 0.288311 0.236530 0.223497 0.182204 0.218099 0.251344 0.225082 0.224585 0.188825 0.225586 0.257379 0.258375 0.248756 0.264484 0.226779 0.227073 0.225495 0.228979 0.229468 0.228498
chargesum: 0.00000
title: Mulliken charges with hydrogens summed into heavy atoms:
elementType: N C C C C C C C C C C C C C C C C C C C C C C C C C C C
charge: -0.095604 0.211630 0.158340 -0.084544 0.244399 0.397797 -0.174064 -0.286691 -0.262173 -0.056884 0.314397 -0.206958 -0.046218 0.278739 0.257716 0.024751 0.014581 -0.023888 -0.131708 -0.150954 -0.163886 -0.141903 -0.006990 -0.009947 -0.014677 -0.007105 -0.017638 -0.020519
polarizability: 4.53886295e+02 2.32050938e+01 2.65465471e+02 -2.05486505e+01 1.62495164e+01 2.43967676e+02
1716.lowfreq: -4.1392 -0.0001 0.0005 0.0010 4.8498 7.0363 22.0635 27.2755 40.1074
frequency: 22.0303 27.2550 40.0714 51.7487 57.1446 60.8574 71.5752 74.3606 83.1578 100.8968 133.5365 159.3451 183.0388 218.9633 227.3532 234.7855 246.4726 251.7848 272.2982 288.0456 304.5478 326.7964 341.6032 372.3726 404.7559 409.7887 411.4926 429.8884 444.3910 459.0005 477.8901 492.8534 511.6101 536.4935 556.0671 577.2707 601.2835 610.8623 616.1829 636.9786 644.1854 661.5600 703.1534 704.6189 710.7188 724.8581 742.5211 758.4539 777.5338 781.5166 790.0290 815.1876 831.5154 853.1347 857.5006 858.0616 870.2523 878.9999 895.6271 923.1753 930.7410 948.7085 955.4318 975.5607 978.9766 982.5507 988.2734 988.5348 989.6355 995.7392 996.8020 1011.4207 1013.9483 1026.0208 1030.4495 1035.5126 1040.6554 1070.0198 1084.1868 1085.3373 1091.4556 1137.5264 1142.8237 1151.6058 1168.7507 1172.5138 1172.8870 1173.5951 1191.9606 1193.9432 1195.1122 1211.0321 1236.0403 1251.3828 1265.5581 1277.6680 1282.6263 1313.6826 1321.8558 1349.1792 1358.2727 1370.4854 1374.2233 1380.1261 1405.5579 1414.0651 1417.3138 1426.7743 1432.6192 1434.8001 1439.9360 1457.5432 1459.2510 1460.2954 1473.7810 1474.0799 1478.8325 1485.6928 1486.0436 1508.0110 1564.8174 1578.4105 1579.4219 1599.9110 1602.3288 1607.5087 1610.5688 1628.3657 2842.4890 2855.3017 2928.7266 2990.9712 3014.6670 3028.4812 3074.9778 3077.6240 3088.8013 3115.2028 3117.4091 3121.6039 3123.0632 3128.3024 3131.4681 3131.5245 3140.7677 3140.9430 3144.0007 3149.6374 3153.1891 3154.4201 3164.2695 3166.4333 3175.4486
redmass: 4.8351 4.9829 4.1784 4.1677 2.8062 3.9339 4.0794 3.9771 3.4060 4.6087 5.0079 3.7333 5.2221 4.1883 1.9406 1.7608 1.1418 4.1368 2.7821 3.6714 3.8270 3.7826 2.4069 2.9405 2.8420 2.8377 2.8007 2.6328 3.7033 4.1316 5.3217 3.5051 5.6322 3.4238 4.0901 4.7282 4.5988 5.4280 6.3819 3.6886 5.7911 4.2450 1.7085 1.8859 3.9419 3.0894 3.4182 1.4630 2.1845 2.1952 3.0782 3.1118 1.5217 1.2595 1.7227 1.6753 2.1028 1.9769 3.2116 1.6096 1.4458 2.3373 1.5011 1.3915 1.4263 1.3909 1.9761 2.3888 5.8437 1.3253 1.3122 2.5847 2.8331 2.4326 2.0635 1.5375 2.0577 2.7437 1.6199 1.6009 1.2823 1.6032 2.2475 1.5590 1.7553 1.0544 1.0541 1.2814 1.1269 1.1275 1.4648 2.0266 1.9192 2.3839 2.7495 1.5727 1.7400 1.4131 1.3566 2.7724 2.0548 2.3367 2.8366 3.4773 2.6403 3.3675 1.1497 3.9533 2.2822 2.2943 1.1925 1.0486 1.2170 1.8332 1.0612 1.0883 2.2048 1.0787 2.2702 3.4444 7.6401 5.9285 5.7829 7.2668 6.1140 6.1171 6.4016 6.6037 1.0572 1.0571 1.0615 1.0953 1.0718 1.0719 1.1011 1.0867 1.1008 1.0862 1.0859 1.0846 1.0846 1.0873 1.0879 1.0903 1.0972 1.0929 1.0930 1.0960 1.0972 1.0960 1.1015 1.1008 1.0956
irintensity: 0.0095 0.0103 0.0829 0.0426 0.2902 0.0309 0.2070 0.4702 1.3941 0.2659 0.3627 0.4566 0.7522 0.0751 0.8661 1.6508 0.0831 0.5594 0.5508 1.0191 0.6014 3.1343 6.7280 2.5489 0.1321 1.5061 3.5035 2.8821 4.3830 1.5004 1.3746 7.6503 0.6098 4.8016 0.6636 8.2612 4.0023 1.5716 0.0509 7.2661 8.4959 3.3855 76.4139 26.2837 6.0631 2.3444 18.6469 53.9599 40.6812 27.1180 3.1360 22.5266 39.6860 0.5008 9.6582 5.7480 12.8364 6.9678 9.4074 1.6810 2.8231 5.4857 5.2371 0.5859 0.5008 0.8803 0.2976 0.3824 0.3576 0.7930 0.7858 48.4681 6.9387 6.6765 6.6599 10.4437 9.2000 6.4671 8.8196 4.0519 5.0363 2.3410 1.8531 0.7927 3.6670 0.0020 0.0641 5.9608 2.0467 0.8381 7.3551 0.5181 2.8775 2.4810 5.1291 0.3124 7.5163 0.5746 0.4734 4.6268 3.4024 11.9863 3.9320 5.7616 0.7142 1.5722 4.7443 1.4694 7.7400 10.7317 3.6924 13.8895 5.1072 1.4329 4.1344 22.3471 10.8732 12.9356 19.6354 16.1872 0.8980 0.9098 1.9743 2.2324 5.2682 1.8220 7.5943 1.1602 54.1916 163.7832 59.2263 13.7117 39.3888 39.7972 29.9997 26.7478 35.4926 3.7819 3.5641 5.2040 1.3683 0.6883 2.5992 18.6660 33.9910 19.3059 23.8982 32.1641 46.2405 26.4639 31.6939 14.5233 16.8199
temp: 298.150 k
press: 1.00000 atm
elementType: 7 6 6 6 6 6 6 6 6 6 6 6 6 6 6 6 6 6 6 6 6 6 6 6 6 6 6 6 1 1 1 1 1 1 1 1 1 1 1 1 1 1 1 1 1 1 1 1 1 1 1 1 1
symmnumber: 1
zpe: 1143677.3 jmol-1
zpe.correction: 0.435604 hartree
zpe.thermalcorrener: 0.459897 hartree
zpe.thermalcorrenthalpy: 0.460841 hartree
zpe.thermalcorrgfe: 0.380421 hartree
zpe.sumelectzpe: -1096.660194 hartree
zpe.sumelectthermal: -1096.635900 hartree
zpe.sumelectthermalent: -1096.634956 hartree
zpe.sumelectthermalfe: -1096.715376 hartree
dipole: -1.0961 0.2443 0.5785
dipole: 1.2632
quadrupole: -154.9787 -156.0321 -156.8278
quadrupole: 3.3063 -4.7648 1.7529
quadrupole: 0.9675 -0.0859 -0.8816 3.3063 -4.7648 1.7529
hfenergy: -1097.0957975 hartree
pointgroup: C01 [X(C27H25N1)]
dipole: 0.4165038 -0.0889521 -0.2561338 debye
polarizability: 449.8153352|-41.7700832|244.6545417|-10.129253|-12.0415914|268.8495656 unknown
InChI: InChI=1S/C27H25N/c1-28(2)20-27-24(18-17-23-15-9-10-16-25(23)27)19-26(21-11-5-3-6-12-21)22-13-7-4-8-14-22/h3-19H,20H2,1-2H3
charge 0 multiplicity 1
53 atoms
N  -1.824663 -2.22781 -1.423493
C  -1.561616 -0.404522 0.312217
C  -2.955543 -0.046697 0.489982
C  -1.093635 -0.992094 -1.014818
C  -0.651089 -0.193576 1.376826
C  -3.415157 0.480142 1.760602
C  -1.143404 0.280891 2.647487
C  0.811277 -0.465162 1.328071
C  -2.47836 0.613458 2.83678
C  -3.918975 -0.177434 -0.569419
C  1.768882 -0.007026 0.44804
C  -4.789043 0.854235 1.923604
C  -5.250825 0.204278 -0.386111
C  3.174121 -0.50693 0.58382
C  1.486885 1.000228 -0.624363
C  -1.690143 -3.320545 -0.439236
C  -1.41836 -2.651196 -2.778526
C  -5.695355 0.724319 0.869725
C  4.285328 0.353141 0.355133
C  2.055638 0.853967 -1.920809
C  3.436243 -1.854652 0.961479
C  0.66008 2.130425 -0.376454
C  5.607523 -0.110422 0.52149
C  1.79325 1.795118 -2.939838
C  4.758384 -2.319076 1.127544
C  0.401823 3.074975 -1.392343
C  5.851887 -1.448497 0.910916
C  0.963384 2.910822 -2.680641
H  -1.236081 -0.24575 -1.822918
H  -0.001039 -1.193251 -0.958311
H  -0.426698 0.398293 3.468937
H  1.178735 -1.068633 2.17211
H  -2.828048 0.987615 3.806462
H  -3.597023 -0.624572 -1.512757
H  -5.115351 1.249124 2.893561
H  -5.965959 0.098237 -1.209751
H  -0.629332 -3.653933 -0.298482
H  -2.28415 -4.19021 -0.772306
H  -2.07826 -2.992189 0.539613
H  -1.607561 -1.834431 -3.498925
H  -2.013964 -3.528848 -3.087151
H  -0.334381 -2.926587 -2.850399
H  -6.743664 1.015616 1.000115
H  4.106106 1.392711 0.059995
H  2.702839 -0.005548 -2.128135
H  2.596066 -2.544999 1.09878
H  0.230456 2.273184 0.620104
H  6.447365 0.572619 0.350917
H  2.235994 1.658887 -3.933061
H  4.936825 -3.362494 1.411557
H  -0.233979 3.9412 -1.177566
H  6.878984 -1.809515 1.035031
H  0.76168 3.645009 -3.468796
