program: Gaussian 09
title: 000264986
version: EM64L-G09RevD.01
frameworkgroup: C1[X(C26H23NO)]
method: RPBEPBE
basis: SDD
operation: Freq
keyword: #p
keyword: freq=noraman
keyword: PBEPBE/SDD
title: #p freq=noraman PBEPBE/SDD
converged: YES YES NO NO
title: Mulliken charges:
elementType: O N C C C C C C C C C C C C C C C C C C C C C C C C C C H H H H H H H H H H H H H H H H H H H H H H H
charge: -0.486849 -0.408887 -0.063293 0.269323 0.235230 0.384062 0.329939 -0.533015 -0.376616 -0.389691 -0.366533 -0.413660 -0.365956 -0.390075 -0.265749 -0.254347 -0.247965 -0.231951 -0.244244 -0.237519 -0.236896 -0.244102 0.445330 -0.369766 -0.429434 -0.226002 -0.198916 -0.282449 0.254670 0.203571 0.263611 0.240447 0.261865 0.236206 0.280248 0.263857 0.357060 0.230363 0.229392 0.320275 0.229566 0.228217 0.231737 0.228776 0.231641 0.230111 0.215673 0.214891 0.213038 0.214432 0.220382
chargesum: 0.00000
title: Mulliken charges with hydrogens summed into heavy atoms:
elementType: O N C C C C C C C C C C C C C C C C C C C C C C C C C C
charge: -0.129788 -0.088613 -0.063293 0.269323 0.235230 0.384062 0.329939 -0.074775 -0.113005 -0.149244 -0.104667 -0.177455 -0.085708 -0.126218 -0.035386 -0.024954 -0.018399 -0.003734 -0.012507 -0.008744 -0.005255 -0.013991 0.445330 -0.154092 -0.214543 -0.012964 0.015517 -0.062067
polarizability: 3.53674049e+02 -2.03932187e+01 2.71006903e+02 8.70905708e+00 9.86886073e+00 2.46592566e+02
1716.lowfreq: -5.2943 -0.0007 -0.0006 -0.0002 3.0801 6.4706 8.4726 20.7110 30.4718
frequency: 3.6519 20.6618 30.3421 39.0493 48.4359 57.9664 65.3107 74.2824 89.3717 115.5726 143.8901 175.6923 211.5792 224.8539 229.0024 239.5796 251.1518 278.3404 285.8419 297.3918 342.1118 350.3429 399.9314 402.4576 404.7174 407.8550 410.1036 440.9474 498.4935 501.7953 504.2745 533.3912 537.2045 577.8603 597.9441 614.9425 615.1382 615.6644 621.8878 633.6117 634.1719 684.6506 689.3415 703.8430 708.4243 750.1788 752.9511 759.5600 767.2265 768.4913 801.7099 809.8334 839.8730 853.9030 859.8759 862.4435 880.5153 882.6702 907.5062 929.5291 937.3526 946.7937 950.5680 961.2116 967.2009 968.1427 976.0555 979.7628 986.2910 989.7004 990.0694 992.1405 998.0925 1000.9287 1021.9306 1027.8395 1030.6586 1052.9143 1069.7492 1085.3165 1089.1503 1094.2186 1104.0493 1158.4859 1161.8176 1166.7683 1173.4023 1173.5977 1177.4551 1187.3705 1192.6060 1194.4215 1204.5672 1209.0843 1220.8542 1281.9608 1292.0060 1301.7736 1317.8099 1320.8652 1328.9965 1355.8717 1373.1258 1377.1254 1379.1785 1385.1707 1431.3811 1433.7484 1435.8358 1437.8673 1477.5622 1479.1370 1480.2020 1483.5210 1491.2585 1512.3963 1580.8937 1583.7976 1588.2754 1590.1321 1606.9594 1609.1136 1611.8563 1624.3917 2975.4199 3049.6862 3108.2383 3118.9450 3121.6534 3124.7565 3126.3223 3131.8572 3132.6162 3132.8173 3136.0754 3143.8973 3148.4370 3148.8226 3150.0158 3152.2541 3158.5879 3163.3944 3163.9916 3166.1395 3168.7925 3528.2515 3548.3041
redmass: 5.0667 4.9659 3.9573 4.1702 3.8766 4.9244 4.7288 4.8999 4.4614 4.3491 5.0802 4.5438 4.0039 4.6698 4.3683 3.4031 4.4415 3.2935 3.8958 1.8125 6.4219 2.5620 2.8489 3.4762 2.8009 2.9662 2.9872 4.3871 2.7665 2.9995 3.4721 3.4698 5.4957 4.4017 1.6226 5.8801 5.4392 6.1932 4.1517 5.7740 4.5986 5.4347 1.8816 1.7438 1.7719 1.8645 2.5602 2.5037 1.4494 1.9206 3.6873 1.3099 2.8235 1.2639 1.2641 1.5477 2.5999 1.6978 3.3736 2.1109 1.7066 2.5087 1.3642 1.5667 1.8129 1.3862 4.9729 1.3982 1.4311 5.6858 5.1015 1.3492 1.3299 1.3148 2.3177 2.3399 2.1437 2.3996 2.2942 1.6945 1.6424 2.3439 2.2628 1.8452 2.6873 1.0523 1.0565 1.0530 1.0917 1.1084 1.1364 1.1245 2.3302 1.9415 1.5635 1.7706 1.6429 1.4796 1.3572 1.3371 1.4280 1.4766 6.6708 8.2032 8.2427 3.8308 2.1838 2.2303 2.2652 2.4485 2.2680 2.2465 2.2447 1.7416 1.1840 2.1460 6.3382 5.0941 6.0652 6.1220 6.0098 6.0555 6.2170 6.2497 1.0649 1.0946 1.0858 1.0860 1.0864 1.0846 1.0849 1.0874 1.0934 1.0890 1.0884 1.0921 1.0931 1.0934 1.0928 1.0956 1.0955 1.1006 1.1003 1.1013 1.1003 1.0759 1.0659
irintensity: 0.1586 0.0056 0.3517 0.2436 0.1341 0.2111 0.1460 0.4832 0.4360 2.5737 0.2076 0.9578 2.8357 2.7166 4.4401 23.8678 3.1969 23.3275 8.8530 62.1208 7.9074 23.3005 0.2641 1.1119 2.1902 0.4853 1.1689 7.6630 24.8579 14.4086 1.7981 9.4101 6.7691 2.6540 65.4446 2.5454 4.7921 0.4755 2.2612 26.1872 33.8854 3.1802 48.1025 56.3228 41.7110 84.9181 5.6887 46.8855 73.4247 52.5882 2.5372 1.2823 13.3250 0.3788 0.4306 8.2536 9.4787 2.9557 10.8764 27.0203 3.1665 33.5182 0.1959 3.7104 6.2033 2.8397 4.0787 0.0418 0.3726 1.2654 1.4682 0.4124 0.1822 0.0842 7.4982 5.2437 8.0588 3.1269 19.6477 3.3913 1.9007 29.3646 19.2191 11.6083 3.4930 2.0010 0.1509 0.0361 1.6504 2.6749 5.0659 5.6796 12.6323 11.4756 58.0350 83.5940 6.2902 23.2081 2.2885 1.0774 26.0863 9.6593 3.4651 1.4101 2.6672 41.5251 13.3375 17.9066 12.0830 15.9203 20.6586 14.3965 11.3575 1.7999 100.6654 255.9108 3.2861 9.4504 1.2514 2.0352 5.1816 8.6859 3.3328 301.9413 43.1314 20.4486 15.8505 6.8864 3.8771 1.4064 0.3364 1.0961 35.9016 6.8092 7.4555 15.9653 53.3562 31.8369 9.9490 27.0744 18.3310 19.6359 28.3291 23.0562 18.8489 106.8578 15.6228
temp: 298.150 k
press: 1.00000 atm
elementType: 8 7 6 6 6 6 6 6 6 6 6 6 6 6 6 6 6 6 6 6 6 6 6 6 6 6 6 6 1 1 1 1 1 1 1 1 1 1 1 1 1 1 1 1 1 1 1 1 1 1 1
symmnumber: 1
zpe: 1083526.0 jmol-1
zpe.correction: 0.412693 hartree
zpe.thermalcorrener: 0.436518 hartree
zpe.thermalcorrenthalpy: 0.437462 hartree
zpe.thermalcorrgfe: 0.355534 hartree
zpe.sumelectzpe: -1132.590467 hartree
zpe.sumelectthermal: -1132.566643 hartree
zpe.sumelectthermalent: -1132.565698 hartree
zpe.sumelectthermalfe: -1132.647627 hartree
dipole: 4.8906 0.6109 -0.1054
dipole: 4.9298
quadrupole: -166.5683 -153.1244 -152.2019
quadrupole: -3.6017 -4.1776 3.8747
quadrupole: -9.2701 4.1738 5.0963 -3.6017 -4.1776 3.8747
hfenergy: -1133.0031603 hartree
pointgroup: C01 [X(C26H23N1O1)]
dipole: -1.9086268 0.2170692 0.2678919 debye
polarizability: 353.8321057|20.0134275|271.7272758|-3.5115332|-11.8780128|245.714137 unknown
InChI: InChI=1S/C26H23NO/c28-26(22-13-4-1-5-14-22,23-15-6-2-7-16-23)25-19-11-10-12-21(25)20-27-24-17-8-3-9-18-24/h1-19,27-28H,20H2
charge 0 multiplicity 1
51 atoms
O  -0.035073 -0.288181 1.339405
N  2.42198 -0.565818 -0.107178
C  -1.200235 -0.044282 0.423824
C  -0.880994 -0.862228 -0.850156
C  -2.451533 -0.554477 1.179484
C  -1.310742 1.464131 0.094504
C  0.386409 -0.756697 -1.505569
C  1.529669 0.145288 -1.033753
C  -1.875523 -1.702802 -1.41184
C  0.615275 -1.535013 -2.667998
C  -3.632756 0.211006 1.331633
C  -0.776098 2.443909 0.965857
C  -2.388848 -1.841327 1.784452
C  -2.003261 1.890335 -1.067391
C  -1.635027 -2.455455 -2.581081
C  -0.374325 -2.380996 -3.210503
C  -4.726997 -0.295067 2.07215
C  -0.927305 3.820203 0.683259
C  -3.479329 -2.345559 2.522337
C  -2.156392 3.265556 -1.351665
C  -4.655719 -1.572129 2.670313
C  -1.620668 4.237717 -0.475697
C  3.782442 -0.298076 0.058588
C  4.507394 0.620361 -0.761346
C  4.50071 -0.989315 1.08608
C  5.891882 0.81562 -0.565192
C  5.87868 -0.777527 1.273518
C  6.594985 0.124733 0.447773
H  1.134059 1.074609 -0.578348
H  2.114055 0.440116 -1.922775
H  -2.853067 -1.775344 -0.925519
H  1.596931 -1.470075 -3.152506
H  -3.700967 1.204715 0.878935
H  -0.209667 2.135349 1.850418
H  -1.481692 -2.44251 1.662478
H  -2.410742 1.144378 -1.758566
H  -0.333528 -0.111823 2.268284
H  -2.425012 -3.094364 -2.990999
H  -0.166322 -2.965947 -4.113172
H  1.922254 -1.000227 0.672373
H  -5.632004 0.312662 2.182695
H  -0.497811 4.564185 1.36355
H  -3.413882 -3.33907 2.979905
H  -2.688723 3.576085 -2.257781
H  -5.503622 -1.960965 3.24514
H  -1.734545 5.304669 -0.697201
H  3.996297 1.194128 -1.541098
H  3.963371 -1.702647 1.724357
H  6.423248 1.526184 -1.21014
H  6.400466 -1.324431 2.068236
H  7.668003 0.285916 0.594324
