program: Gaussian 09
title: 000264938
version: EM64L-G09RevD.01
frameworkgroup: C1[X(C11H9N5O3)]
method: RPBEPBE
basis: SDD
operation: Freq
keyword: #p
keyword: freq=noraman
keyword: PBEPBE/SDD
title: #p freq=noraman PBEPBE/SDD
converged: YES YES NO NO
title: Mulliken charges:
elementType: O O O N N N N N C C C C C C C C C C C H H H H H H H H H
charge: -0.257535 -0.214351 -0.217787 -0.365126 -0.121486 0.022253 -0.627156 0.024310 0.471523 -0.025536 -0.348365 -0.355720 0.318751 0.377928 -0.401636 -0.367271 -0.354987 0.057729 -0.238143 0.249418 0.247554 0.300366 0.287263 0.283005 0.319254 0.245255 0.319112 0.371378
chargesum: 0.00000
title: Mulliken charges with hydrogens summed into heavy atoms:
elementType: O O O N N N N N C C C C C C C C C C C
charge: -0.257535 -0.214351 -0.217787 -0.045872 -0.121486 0.022253 0.063334 0.024310 0.471523 -0.025536 -0.098947 -0.108166 0.318751 0.377928 -0.101271 -0.080008 -0.071982 0.057729 0.007112
polarizability: 4.45270660e+02 -1.53847891e+01 1.87019071e+02 6.61263145e-02 -1.64367534e-01 6.27599661e+01
1716.lowfreq: -4.4986 -2.1733 0.0001 0.0004 0.0006 5.9762 27.8268 35.3157 54.9050
frequency: 27.7820 35.2858 54.8923 70.1398 76.9488 139.7333 158.2654 179.5348 191.4417 218.5624 265.3029 291.6552 325.3869 347.8837 371.8626 406.5378 413.9267 420.3066 477.5528 500.5321 510.3938 534.4928 537.6260 570.9819 590.0813 625.7117 642.6346 649.2545 666.3890 714.5958 716.0340 742.1018 774.9248 776.9037 848.4612 849.4343 857.0005 866.6795 887.4904 957.6812 984.2245 987.1425 999.5928 1000.1446 1009.3650 1092.3328 1104.8148 1127.1060 1166.3074 1176.9055 1214.4217 1226.8617 1272.6373 1291.8344 1341.1273 1356.2398 1370.5260 1381.1153 1410.0003 1420.2088 1476.5244 1484.4132 1522.7047 1551.7517 1572.5234 1587.6100 1600.5618 1608.8121 1625.3570 3065.8083 3128.6778 3142.6675 3160.8825 3183.0566 3185.6348 3468.1846 3532.3619 3670.8465
redmass: 5.9286 7.6318 7.1860 6.7579 7.9566 8.0046 9.5031 4.8089 7.7948 6.1160 5.1201 1.3041 2.5678 4.8312 4.1582 8.8519 2.9144 5.8733 3.1197 8.8934 7.3203 4.0556 7.0204 6.3945 1.1997 7.2036 7.5035 4.8530 4.4071 1.2609 8.7193 4.3611 9.2938 8.5425 4.9673 1.2507 6.9916 1.6079 1.4575 2.5893 4.5458 1.3616 2.8533 1.3687 1.5066 3.3921 1.3358 1.9182 1.6675 2.5650 5.1180 3.2857 3.0196 1.3539 2.0038 4.2425 1.4847 2.3271 3.8935 4.7504 3.1580 4.0412 3.6074 2.1771 3.9835 5.6828 4.3996 6.7278 4.2274 1.0901 1.0931 1.0905 1.0881 1.0949 1.0961 1.0501 1.0787 1.0988
irintensity: 4.8984 0.0128 3.4068 0.0347 5.4875 5.0356 6.2490 2.5964 0.8654 1.5066 7.4400 53.0237 39.0681 4.0818 1.5143 0.0924 0.1282 14.6708 21.8502 0.9048 0.1589 1.7000 5.4064 2.0753 222.7943 0.1914 0.6318 3.6452 17.0458 98.9354 11.4848 0.3840 9.4737 26.7944 3.8521 0.1444 1.6821 51.9949 12.4723 13.2407 6.7389 19.2695 0.2684 0.0197 20.6421 36.5068 18.0960 32.8658 111.5558 93.0605 865.7650 6.9325 12.1572 4.0934 64.8475 142.4599 8.5811 81.8691 13.1893 31.4153 113.1354 210.8217 77.6265 200.5921 45.9589 23.0124 13.5055 194.2985 433.6259 0.5732 24.5285 5.0277 4.4367 0.4461 1.3194 30.3586 50.9413 108.6727
temp: 298.150 k
press: 1.00000 atm
elementType: 8 8 8 7 7 7 7 7 6 6 6 6 6 6 6 6 6 6 6 1 1 1 1 1 1 1 1 1
symmnumber: 1
zpe: 519141.6 jmol-1
zpe.correction: 0.197731 hartree
zpe.thermalcorrener: 0.213816 hartree
zpe.thermalcorrenthalpy: 0.214760 hartree
zpe.thermalcorrgfe: 0.152489 hartree
zpe.sumelectzpe: -922.580830 hartree
zpe.sumelectthermal: -922.564744 hartree
zpe.sumelectthermalent: -922.563800 hartree
zpe.sumelectthermalfe: -922.626072 hartree
dipole: -9.0596 7.7458 0.0426
dipole: 11.9196
quadrupole: -123.7736 -101.5686 -111.4316
quadrupole: -42.0776 -0.0591 -0.0169
quadrupole: -11.5157 10.6893 0.8263 -42.0776 -0.0591 -0.0169
hfenergy: -922.7785603 hartree
pointgroup: C01 [X(C11H9N5O3)]
dipole: 3.6289335 2.2437003 -1.9463574 debye
polarizability: 445.3665442|16.0868035|129.588739|3.0508546|-61.444687|120.0944143 unknown
InChI: InChI=1S/C11H9N5O3/c12-10-9(11(17)15-6-14-10)13-5-7-1-3-8(4-2-7)16(18)19/h1-6,14H,12H2
charge 0 multiplicity 1
28 atoms
O  2.727733 -1.55089 1.914629
O  -6.074161 -0.445728 0.457776
O  -5.649911 1.217359 -1.048209
N  4.842307 1.057853 -0.427555
N  1.300289 0.353249 0.0593
N  4.799664 -0.689512 1.220554
N  2.861162 1.975446 -1.396234
N  -5.263986 0.315759 -0.203395
C  -1.043836 -0.166968 0.435493
C  2.67681 0.212781 0.258382
C  -1.982415 -0.97885 1.138331
C  -1.532872 0.808469 -0.484028
C  3.457484 1.097011 -0.536175
C  -3.812624 0.147418 0.017917
C  0.387619 -0.368449 0.688672
C  -3.365052 -0.829287 0.936349
C  -2.908825 0.9713 -0.697341
C  3.351444 -0.727432 1.176636
C  5.448476 0.153157 0.459924
H  -1.613535 -1.729918 1.846113
H  -0.80858 1.428516 -1.019798
H  0.676783 -1.139737 1.419577
H  -4.097791 -1.4430 1.466436
H  -3.304909 1.712488 -1.396381
H  5.428306 1.681728 -0.986794
H  6.544393 0.191955 0.482947
H  3.361042 2.631944 -1.988783
H  1.837687 1.921537 -1.396443
