program: Gaussian 09
title: 000264918
version: EM64L-G09RevD.01
frameworkgroup: C1[X(C9H8ClNO3)]
method: RPBEPBE
basis: SDD
operation: Freq
keyword: #p
keyword: freq=noraman
keyword: PBEPBE/SDD
title: #p freq=noraman PBEPBE/SDD
converged: YES YES NO NO
title: Mulliken charges:
elementType: Cl O O O N C C C C C C C C C H H H H H H H H
charge: -0.008654 -0.430985 -0.170882 -0.127440 -0.393262 -0.503195 -0.413302 0.291650 -0.394175 0.212831 -0.171455 0.399249 0.074804 -0.507064 0.230321 0.270382 0.218807 0.231201 0.233454 0.229618 0.348640 0.379456
chargesum: 0.00000
title: Mulliken charges with hydrogens summed into heavy atoms:
elementType: Cl O O O N C C C C C C C C C
charge: -0.008654 -0.051529 -0.170882 -0.127440 -0.044622 -0.002493 0.036706 0.291650 0.068898 0.212831 -0.171455 0.399249 0.074804 -0.507064
polarizability: 1.70799002e+02 -1.21965137e+01 1.58785367e+02 -2.45496757e+00 2.78137916e-01 5.98300312e+01
1716.lowfreq: -6.3908 0.0000 0.0006 0.0012 4.6636 7.9078 60.6882 79.4049 98.4923
frequency: 60.6832 79.4019 98.4894 144.2002 183.9680 205.9703 245.4635 264.6730 292.5740 313.1543 338.8824 354.0693 391.6847 454.6022 466.3998 491.9879 548.5442 567.4335 570.5733 588.8443 610.4907 692.1483 716.5142 773.9914 825.7197 848.0630 866.0089 896.5457 932.9742 990.1887 1066.1091 1077.4553 1106.0189 1171.2880 1174.9393 1180.7947 1196.2544 1258.8922 1271.5346 1292.4052 1331.8779 1346.3496 1366.2280 1403.3631 1459.5399 1466.5687 1474.2139 1522.1955 1532.8880 1580.9168 1598.4454 1632.9191 2963.8895 2978.7552 3007.2536 3049.7222 3053.6590 3074.5131 3462.6965 3549.8071
redmass: 7.4908 7.4073 3.4010 5.1641 10.4178 5.6702 4.2587 4.0696 12.8883 2.5370 4.9559 11.4522 9.3012 6.8798 3.7301 3.5577 1.7547 1.2829 2.5558 4.7010 3.8957 9.4021 3.8269 8.0984 4.1364 4.1604 1.8534 2.2086 3.5416 2.7613 3.1462 2.4087 2.3062 2.0416 1.9340 2.2091 1.4420 1.3486 2.2115 1.8343 1.3283 1.3965 2.6214 2.2131 1.1224 1.1076 1.1233 2.6920 5.7357 12.3897 7.8132 8.6655 1.0669 1.0679 1.0619 1.0949 1.0930 1.1040 1.0646 1.0778
irintensity: 0.0253 0.8470 0.2644 0.5773 0.1205 0.7400 2.1940 2.4595 2.3176 7.3347 17.0872 5.0263 0.0969 0.4286 14.3823 8.9980 58.6656 172.4911 22.2633 8.6308 11.5743 0.6588 28.6481 64.2697 0.7011 1.3792 1.3942 0.4792 6.0326 23.9130 40.3384 32.4084 16.3193 119.3863 35.1388 47.3622 35.4223 13.1840 41.7843 6.6114 25.7183 43.2268 10.2516 15.1596 9.1738 27.5411 15.4523 455.4462 104.9855 73.0640 69.5076 16.4350 46.2340 24.2061 24.5211 23.8679 28.4031 38.8191 59.2218 114.9194
temp: 298.150 k
press: 1.00000 atm
elementType: 17 8 8 8 7 6 6 6 6 6 6 6 6 6 1 1 1 1 1 1 1 1
symmnumber: 1
zpe: 415497.4 jmol-1
zpe.correction: 0.158255 hartree
zpe.thermalcorrener: 0.170558 hartree
zpe.thermalcorrenthalpy: 0.171502 hartree
zpe.thermalcorrgfe: 0.119459 hartree
zpe.sumelectzpe: -1087.203411 hartree
zpe.sumelectthermal: -1087.191107 hartree
zpe.sumelectthermalent: -1087.190163 hartree
zpe.sumelectthermalfe: -1087.242206 hartree
dipole: 4.9669 -7.9841 -0.0711
dipole: 9.4033
quadrupole: -80.0725 -97.1711 -86.7381
quadrupole: 5.6125 -0.4219 0.2944
quadrupole: 7.9214 -9.1772 1.2558 5.6125 -0.4219 0.2944
hfenergy: -1087.3616651 hartree
pointgroup: C01[X(C9H8Cl1N1O3)]
dipole: 2.4923658 -2.7326791 -0.0843977 debye
dipolederiv: -0.6767737 -0.3403834 0.0242654 -0.4644825 -0.3842871 0.0182434 0.0230509 0.0134641 -0.0162574 -0.3011971 -0.0338545 -0.0065998 0.2379473 -1.2450814 -0.0025373 -0.0046891 0.0078264 -0.3744607 -0.461908 -0.0378093 0.0055585 0.2356521 -1.1186099 -0.0187555 0.0073609 -0.0042346 -0.3055804 -0.7133472 0.3078818 0.0062766 0.2224128 -0.4474105 -0.003356 0.0176041 -0.0087009 -0.2833737 -0.820648 0.599247 0.033378 0.2658779 -0.7958645 -0.0327907 -0.0894153 0.0220712 -0.416028 0.0007003 0.0230592 0.0034452 -0.0003086 -0.0016501 -0.0118881 0.0155027 -0.0007781 0.1660399 0.0229627 0.0562293 -0.017647 -0.0089243 -0.0035951 -0.0117346 -0.0039264 -0.0097639 0.1164772 -0.3254875 0.4854634 -0.0098459 0.5140194 -0.6868477 -0.0131164 -0.0489492 -0.031672 -0.1481948 0.6019764 -0.1202419 -0.0599968 0.2029386 0.0609252 -0.0550194 0.046009 -0.0973568 0.3035896 0.626335 -0.7470882 -0.0230063 -0.5406948 0.7882785 0.0340227 0.0112939 0.0436351 0.099191 0.6784165 -0.3556641 -0.0323492 -0.4590863 1.1536547 0.0207602 -0.0247771 0.0204397 0.1240319 0.2303762 0.0775963 -0.0038821 -0.3775545 1.1675583 0.0013379 0.0051654 -0.0266363 0.1348167 0.4583554 -0.5175443 -0.006656 -0.4900519 0.6943539 0.0084008 -0.0194837 0.006871 0.2387346 0.5128687 0.5867061 -0.0268749 0.8745242 -0.1625894 -0.025113 -0.0183505 -0.0104783 -0.1496797 -0.0261796 -0.0539224 0.0377054 -0.0166021 0.0642143 0.0404508 0.0595314 0.0829441 -0.1049211 0.0664796 0.0432604 0.0084116 -0.0306247 -0.020205 -0.0722564 -0.0285689 -0.0778612 0.0529301 -0.1742526 -0.0813099 0.0110072 -0.0964069 0.0680316 0.0037656 0.0342918 0.0092021 0.0887624 0.0964965 0.010117 0.0474785 0.0273016 0.0354561 0.0368154 -0.0218393 0.0078357 -0.1445683 -0.0635553 0.0457533 0.0272601 -0.1037224 0.1034703 0.0218611 0.1055963 -0.0261415 -0.1469096 -0.0758674 0.0917823 -0.0310434 0.0903171 -0.0294885 0.0593833 -0.0838433 0.0855423 0.0617526 0.18811 0.0047751 0.0032341 -0.0809526 0.301512 0.0023134 0.0088023 -0.0067745 0.3274036 0.1561391 -0.0440531 0.0098809 -0.0015795 0.4581743 -0.0007872 0.009634 0.0005664 0.3762443 unknown
polarizability: 174.6779852|-9.2077108|154.8135452|-4.0854364|0.7466131|59.9228703 unknown
InChI: InChI=1S/C9H8ClNO3/c10-5-8(13)6-4(2-1-3-11-6)7(12)9(5)14/h11,13H,1-3H2
charge 0 multiplicity 1
22 atoms
Cl -3.346842 -1.592697 0.101644
O  -0.513239 -2.720619 0.005522
O  -0.426041 2.827863 0.00193
O  -2.906383 1.491237 0.061547
N  1.810103 -1.451121 -0.121711
C  2.126005 1.43243 -0.106509
C  3.231923 0.499045 0.439843
C  0.770108 0.750797 -0.07103
C  3.168018 -0.888717 -0.237453
C  0.698523 -0.64313 -0.064473
C  -0.437951 1.554809 -0.014793
C  -0.60475 -1.337431 0.000148
C  -1.83524 0.829743 0.03093
C  -1.788227 -0.639328 0.04112
H  2.367841 1.744028 -1.142862
H  2.070992 2.366967 0.479457
H  4.23016 0.937943 0.263984
H  3.109463 0.373942 1.531832
H  3.445992 -0.796437 -1.30803
H  3.878419 -1.591928 0.233245
H  1.666436 -2.462737 -0.112364
H  -1.422812 -3.126555 0.046822
