program: Gaussian 09
title: 000264912
version: EM64L-G09RevD.01
frameworkgroup: C1[X(C8H7ClN2O2)]
method: RPBEPBE
basis: SDD
operation: Freq
keyword: #p
keyword: freq=noraman
keyword: PBEPBE/SDD
title: #p freq=noraman PBEPBE/SDD
converged: NO NO NO NO
title: Mulliken charges:
elementType: Cl O O N N C C C C C C C C H H H H H H H
charge: -0.047827 -0.197508 -0.194461 -0.303663 0.090069 0.510472 -0.329302 -0.332580 -0.070389 -0.191120 0.231910 -0.229494 -0.745036 0.279469 0.262785 0.240734 0.262886 0.249221 0.255997 0.257838
chargesum: 0.00000
title: Mulliken charges with hydrogens summed into heavy atoms:
elementType: Cl O O N N C C C C C C C C
charge: -0.047827 -0.197508 -0.194461 -0.303663 0.090069 0.510472 -0.049833 -0.069795 -0.070389 0.049614 0.231910 0.033393 0.018020
polarizability: 1.57998176e+02 -2.09876670e-01 1.25229801e+02 -1.36257940e+00 3.03820684e+00 7.06090217e+01
1716.lowfreq: -10.8783 -2.9387 -0.0020 -0.0017 -0.0017 3.1551 34.8473 65.3013 88.1243
frequency: 34.8277 65.2837 88.1229 122.1521 149.5619 179.2317 201.9202 230.0427 255.0176 306.1179 332.6817 386.6217 432.9769 438.3735 448.5669 518.2040 539.4384 598.2902 634.0756 661.5697 682.8343 766.2138 783.5764 854.2724 887.4973 906.8270 974.3160 982.7422 988.2622 1035.3516 1036.8144 1073.9377 1095.8614 1173.3576 1180.4066 1277.6313 1290.4821 1380.9956 1388.6592 1392.8215 1425.5491 1445.4560 1455.7086 1459.6725 1580.1115 1598.9843 1641.4836 3014.2667 3103.2411 3139.8208 3153.5426 3177.8762 3187.0706 3189.9925
redmass: 8.6352 3.9691 6.3554 11.2170 1.0368 5.8774 8.0449 8.2200 6.9411 5.7581 4.1591 8.8536 3.7860 8.3030 5.4391 5.0503 4.4706 3.8106 5.0547 7.3982 2.3964 6.6742 1.5103 2.1573 1.9944 1.4793 1.5649 4.3978 4.6117 2.2698 1.7163 1.9974 1.5515 2.6551 1.1709 4.9158 1.3460 9.9669 1.2266 8.3551 3.1536 1.0709 1.0477 2.3686 6.8854 6.8373 9.3604 1.0364 1.0968 1.1019 1.0881 1.0935 1.0960 1.0964
irintensity: 0.0935 5.6306 2.1212 1.7749 0.2510 1.1370 4.6157 4.8005 1.1416 1.1061 5.6111 5.4944 4.1652 10.2233 7.1870 19.6990 2.9216 6.5547 42.6800 13.2743 52.2940 114.7917 26.4693 75.4181 84.9457 2.8396 4.3098 19.2223 10.8514 20.2982 4.7175 20.8950 10.2844 114.2039 14.5274 166.4366 10.2784 2.1480 53.6952 187.7635 19.2036 19.4739 18.8014 50.3813 50.9520 12.0261 105.9364 0.3042 4.3197 11.4540 6.1702 2.4150 1.0305 2.9159
temp: 298.150 k
press: 1.00000 atm
elementType: 17 8 8 7 7 6 6 6 6 6 6 6 6 1 1 1 1 1 1 1
symmnumber: 1
zpe: 360965.5 jmol-1
zpe.correction: 0.137484 hartree
zpe.thermalcorrener: 0.149821 hartree
zpe.thermalcorrenthalpy: 0.150765 hartree
zpe.thermalcorrgfe: 0.097755 hartree
zpe.sumelectzpe: -1028.058283 hartree
zpe.sumelectthermal: -1028.045947 hartree
zpe.sumelectthermalent: -1028.045003 hartree
zpe.sumelectthermalfe: -1028.098013 hartree
dipole: -1.3165 1.3336 0.5924
dipole: 1.9654
quadrupole: -74.7050 -84.5244 -84.3261
quadrupole: 7.1948 0.9781 10.3994
quadrupole: 6.4802 -3.3392 -3.1409 7.1948 0.9781 10.3994
hfenergy: -1028.1957678 hartree
pointgroup: C01 [X(C8H7Cl1N2O2)]
dipole: 0.4576352 -0.5486382 0.2957228 debye
dipolederiv: -0.5294237 0.2407031 -0.1969865 0.3164769 -0.2990305 0.1781327 -0.2254633 0.1571307 -0.1818146 -0.6092708 -0.0310028 0.0147924 0.1950391 -0.8273065 -0.3002277 0.1796635 -0.2421782 -0.4195798 -0.1542826 0.7093357 0.38402 -0.0541138 -0.7714567 -0.3159904 -0.0761848 -0.4259598 -0.3342554 -0.7529985 0.0644553 0.0918528 0.318245 -1.0795363 -0.4832174 0.1958869 -0.4491678 -0.3436414 -0.1837328 -0.3507286 -0.1685858 0.1134027 1.3759145 0.7172247 0.1246754 0.7382526 0.3295558 0.4773723 0.100313 0.0516803 0.0702165 0.0515548 -0.2035595 0.0452121 -0.123965 0.1003893 -0.2812774 0.1736341 -0.0787934 0.1150748 -0.0887666 0.0347108 -0.0138028 0.0711142 -0.089275 -0.0610272 -0.122967 0.0121694 -0.0409337 -0.0565411 -0.0027688 -0.0327739 0.0102027 -0.0938522 0.7323179 -0.4846618 0.3314494 -0.539565 0.367291 -0.3198135 0.3966343 -0.2508666 0.1571768 0.0288801 0.0592318 0.0112434 0.0415702 0.0833965 -0.1053971 -0.0180802 -0.0901609 -0.0848092 1.5180918 -0.353432 -0.3632821 -0.5341762 1.0807766 0.5192911 -0.4277388 0.4472196 0.4671183 -0.1200983 0.102441 -0.0639991 0.1648469 -0.1295392 0.0595526 -0.0889346 0.0221997 -0.1454689 -0.4174043 -0.1296938 0.0006224 -0.2199021 -0.0465259 0.0013572 -0.0484738 -0.0058778 0.0171556 0.1062612 -0.0353965 0.0037302 -0.0406416 0.0419295 0.0573157 -0.0049841 0.0183511 0.1145078 0.0201485 0.0608645 -0.049219 0.0570909 0.0820422 0.0497211 -0.0360049 0.0195459 0.1183048 0.0573757 -0.032221 0.001943 -0.0446653 -0.0369491 0.0951392 0.0028089 0.0911462 0.1099651 -0.0265026 -0.0429563 -0.0039695 -0.0308961 0.1089103 0.0276952 -0.0052434 0.0188818 0.1548747 0.0021842 0.0429291 0.0387242 0.1100939 0.022052 -0.063145 0.0627484 -0.0528754 0.0930314 0.0933932 -0.004984 0.0060057 -0.0067805 0.1195941 -0.0310399 -0.0299742 -0.0265622 -0.0473432 0.0999932 0.0341364 -0.0233978 0.0096172 0.0021904 0.0850191 0.0000294 0.073569 0.0779603 unknown
polarizability: 157.1551437|-2.1242957|124.966027|7.4897158|-6.1318578|71.7158282 unknown
InChI: InChI=1S/C8H7ClN2O2/c1-6(12)11(10-13)8-4-2-3-7(9)5-8/h2-5H,1H3
charge 0 multiplicity 1
20 atoms
Cl -3.71366 1.254897 -1.113208
O  2.117533 -1.671861 -0.889865
O  0.815509 2.2969 1.069694
N  1.30388 0.290051 0.082796
N  1.738498 1.568688 0.604337
C  -0.070343 -0.159563 0.113458
C  -1.076314 0.662916 -0.449099
C  -0.393766 -1.395931 0.721017
C  -2.406161 0.211621 -0.391905
C  -1.738653 -1.818044 0.753626
C  2.377231 -0.533605 -0.434937
C  -2.762365 -1.015185 0.199632
C  3.770644 0.062397 -0.390333
H  -0.829412 1.615866 -0.921753
H  0.395971 -2.022441 1.14246
H  -1.996519 -2.77791 1.211716
H  -3.807269 -1.335824 0.225472
H  4.463741 -0.672297 -0.825929
H  4.07438 0.296205 0.643884
H  3.822975 1.00742 -0.956265
