program: Gaussian 09
title: 000265024
version: EM64L-G09RevD.01
frameworkgroup: C1[X(C21H23N7O6)]
method: RPBEPBE
basis: SDD
operation: Freq
keyword: #p
keyword: freq=noraman
keyword: PBEPBE/SDD
title: #p freq=noraman PBEPBE/SDD
converged: YES YES NO NO
title: Mulliken charges:
elementType: O O O O O O N N N N N N N C C C C C C C C C C C C C C C C C C C C C H H H H H H H H H H H H H H H H H H H H H H H
charge: -0.398905 -0.295686 -0.243988 -0.419108 -0.225533 -0.192443 -0.390167 -0.455928 0.064962 -0.020487 -0.409475 -0.037534 -0.612901 -0.377777 -0.134280 -0.389716 -0.441194 -0.513409 -0.486635 0.476691 0.259441 0.290117 0.148785 0.112865 -0.440361 -0.391335 -0.348291 -0.353425 -0.450013 -0.158543 0.169559 0.180370 -0.004234 0.156594 0.235708 0.249878 0.308286 0.248038 0.286511 0.215075 0.233581 0.224726 0.210647 0.271570 0.254986 0.295516 0.340541 0.221537 0.228119 0.273868 0.202562 0.258847 0.326214 0.387973 0.377341 0.318846 0.361612
chargesum: 0.00000
title: Mulliken charges with hydrogens summed into heavy atoms:
elementType: O O O O O O N N N N N N N C C C C C C C C C C C C C C C C C C C C C
charge: -0.010932 -0.295686 -0.243988 -0.041767 -0.225533 -0.192443 -0.094651 -0.115386 0.064962 -0.020487 -0.083261 -0.037534 0.067556 0.107808 0.174006 0.144834 0.007462 -0.078036 0.039921 0.476691 0.259441 0.290117 0.148785 0.112865 -0.218824 -0.163216 -0.074422 -0.150863 -0.191166 -0.158543 0.169559 0.180370 -0.004234 0.156594
polarizability: 4.36453591e+02 -7.86551436e+00 2.99430304e+02 -9.71762691e+00 1.70513707e+01 2.36679587e+02
1716.lowfreq: -5.6541 -2.9031 -0.0008 -0.0002 0.0005 2.9683 6.1758 10.1963 12.1538
frequency: 0.2188 7.8058 11.8754 14.9069 18.5272 26.7659 31.3919 41.7289 43.2897 51.1322 67.5226 70.3353 73.5981 88.9437 106.1342 123.8542 140.2634 147.3343 166.7476 177.4715 187.8204 199.2697 205.3768 217.4773 232.4712 263.9252 283.5935 290.5137 305.8782 321.6749 327.5809 350.3673 363.7925 403.0039 408.3670 419.7905 425.4270 441.4778 443.8164 452.6515 463.5822 475.9967 502.5681 503.1531 523.4946 542.4604 550.3969 557.3615 562.2847 574.5977 580.3707 589.5805 608.4601 613.9194 628.3354 632.2034 637.3406 637.6456 643.5012 683.6345 697.4985 698.7711 725.2092 735.2734 753.4882 754.3821 767.6959 779.5000 803.6492 811.1716 817.0212 832.5464 840.5625 869.4193 875.0629 898.5838 909.9249 925.9344 930.8116 933.7840 975.5913 986.9302 997.0171 1016.8322 1023.9909 1027.6123 1031.4307 1043.6298 1059.4098 1063.0994 1087.6806 1095.2047 1105.1139 1118.5101 1125.9966 1157.6413 1171.9492 1185.1266 1189.4524 1204.6842 1221.9786 1236.9839 1241.4879 1257.7015 1264.2074 1264.3611 1266.5572 1280.1351 1287.5604 1289.6439 1295.2351 1299.1252 1326.2633 1333.1506 1334.2766 1347.8127 1354.4801 1361.2892 1363.8667 1378.4030 1379.8659 1437.7262 1438.4395 1440.5730 1458.6449 1461.0130 1465.8747 1469.8889 1474.9291 1487.2131 1491.5949 1513.7900 1529.9780 1535.7823 1556.7594 1589.1583 1591.4414 1598.8490 1631.7888 1643.5270 1644.5618 1670.5971 2978.2892 2983.8027 2989.6303 3000.2805 3000.7689 3032.6120 3034.6002 3040.4308 3042.3214 3072.6746 3101.0148 3116.2683 3117.5055 3144.9190 3156.5799 3160.9671 3509.0455 3513.4498 3518.7768 3533.8557 3548.8022 3562.8264 3700.5601
redmass: 8.0339 7.3830 9.2538 11.4470 8.1384 5.9802 5.8350 4.1698 7.6272 8.4352 5.5616 6.3891 5.2973 2.7412 4.9213 2.7994 5.1742 5.0075 6.0082 5.2409 6.2521 3.9472 4.5160 4.0868 4.7640 3.5158 4.7185 4.8460 1.1716 5.0142 3.8642 4.2600 4.2272 3.4695 3.4222 3.2179 4.4650 6.1426 1.8974 4.0517 3.3447 7.3478 2.1184 2.2094 4.3506 3.2853 1.2923 4.0276 2.7617 1.3796 3.0871 3.7872 4.4423 4.1073 1.5780 1.6859 1.3558 5.7197 7.1124 3.6543 9.0364 6.1075 4.5279 3.9078 1.6012 3.3166 2.1785 2.0975 1.4056 3.7381 8.9730 4.9836 1.6946 1.6622 3.9864 4.4744 4.7692 1.5789 1.5544 2.3601 3.3325 1.3522 3.0136 2.6746 2.8543 5.0999 3.3827 2.7460 2.1767 1.9206 2.9375 2.5716 2.4862 3.0170 1.5249 1.7152 1.7093 1.5974 2.5434 1.2206 1.4466 1.8580 1.4255 1.8350 2.0147 2.0780 1.6291 1.6081 1.2791 1.8361 1.6116 1.1809 1.6714 1.8491 1.5200 2.1764 2.1767 1.5899 2.4430 2.2875 1.9075 6.6720 3.0761 1.2097 1.9056 1.5746 1.4005 1.3538 1.0982 1.5942 1.3028 8.3806 3.7455 4.7186 4.3204 3.1215 5.5284 2.3772 6.4025 2.8347 8.1620 8.2208 1.0618 1.0591 1.0611 1.0601 1.0816 1.0984 1.0636 1.0952 1.1025 1.1053 1.1037 1.0884 1.0889 1.0932 1.0934 1.0949 1.0777 1.0639 1.0642 1.0770 1.0456 1.0769 1.1053
irintensity: 0.3042 0.7390 6.5830 1.5673 0.3566 2.2308 1.5739 0.8180 4.7430 0.1968 2.3506 0.6934 2.8714 0.9480 1.5389 0.9140 1.4243 0.0589 7.1135 8.4575 2.0114 2.6140 0.2818 10.0430 2.0085 4.1599 4.6676 0.9471 59.4508 0.4515 1.6765 3.6275 0.8890 9.7774 14.8491 1.2364 36.4668 9.9653 65.0042 18.7846 40.5086 4.2090 19.5357 20.0367 18.4839 124.2013 201.8825 52.5094 103.6097 36.1300 5.0523 4.9879 5.7955 11.1751 63.8529 95.9930 122.7138 8.0770 3.0285 53.2913 19.0437 0.9609 11.2026 1.3940 8.8064 24.8542 14.8600 25.1814 13.6175 9.4806 9.0195 0.1331 54.2707 0.1159 9.2583 16.1209 13.6685 13.8675 0.4906 5.1165 1.6833 0.8972 2.9398 65.6468 106.8258 10.9134 33.1665 231.7370 149.4310 1.7376 57.5992 30.7559 57.1109 7.1195 13.5223 4.3927 26.6745 7.9133 21.9130 109.5296 8.3882 8.4703 27.9680 15.7033 49.1484 89.2336 17.0380 37.8165 21.3917 13.4772 68.7819 42.2182 9.8954 7.9792 59.6630 21.6993 356.8835 33.9084 159.2068 52.3397 33.5259 308.4344 7.4987 23.4930 63.9390 13.4444 72.5678 63.4794 1.0429 406.5130 184.0880 91.2335 162.8050 76.9414 55.8056 431.1036 134.7986 235.8052 414.3413 481.0487 145.0544 215.8769 35.9995 19.8073 10.9104 41.3864 16.2311 13.3663 10.8934 6.6703 1.1350 40.4492 8.7159 38.7613 2.5648 17.8719 22.6000 6.5043 32.9083 21.9509 42.4716 39.3148 156.4135 46.4998 48.3672
temp: 298.150 k
press: 1.00000 atm
elementType: 8 8 8 8 8 8 7 7 7 7 7 7 7 6 6 6 6 6 6 6 6 6 6 6 6 6 6 6 6 6 6 6 6 6 1 1 1 1 1 1 1 1 1 1 1 1 1 1 1 1 1 1 1 1 1 1 1
symmnumber: 1
zpe: 1141648.4 jmol-1
zpe.correction: 0.434831 hartree
zpe.thermalcorrener: 0.467536 hartree
zpe.thermalcorrenthalpy: 0.468480 hartree
zpe.thermalcorrgfe: 0.358219 hartree
zpe.sumelectzpe: -1646.223397 hartree
zpe.sumelectthermal: -1646.190691 hartree
zpe.sumelectthermalent: -1646.189747 hartree
zpe.sumelectthermalfe: -1646.300008 hartree
dipole: 4.1521 7.1617 5.9695
dipole: 10.2061
quadrupole: -198.8731 -165.6979 -206.1555
quadrupole: 46.9858 -10.8882 -10.8386
quadrupole: -8.6309 24.5442 -15.9133 46.9858 -10.8882 -10.8386
hfenergy: -1646.6582275 hartree
pointgroup: C01 [X(C21H23N7O6)]
dipole: -1.6711446 0.9261507 -3.5317014 debye
polarizability: 435.7409647|-5.7265181|261.1867848|-16.6241519|-34.4925627|275.6357317 unknown
InChI: InChI=1S/C21H23N7O6/c22-21-27-17-16(19(32)28-21)25-13(10-24-17)2-1-9-23-12-5-3-11(4-6-12)18(31)26-14(20(33)34)7-8-15(29)30/h3-6,10,14,23,26-27,29,33H,1-2,7-9,22H2
charge 0 multiplicity 1
57 atoms
O  6.813628 3.31712 -1.955126
O  4.848408 1.112008 2.179852
O  5.034662 1.988151 -2.630765
O  8.98444 -1.923489 -1.35386
O  9.587489 -0.498235 0.376818
O  -7.573271 -0.1516 2.155425
N  -0.625613 -2.339846 1.856299
N  4.702437 0.96264 -0.123546
N  -5.532627 -0.615679 0.169808
N  -5.57589 1.077758 -2.124417
N  -7.456444 2.188696 -1.235739
N  -8.464062 1.594557 0.87564
N  -9.347115 3.336752 -0.398214
C  -2.576215 -1.477834 0.50686
C  5.869516 1.828972 -0.306312
C  7.227146 1.126561 0.006629
C  -1.624921 -2.657902 0.831289
C  -3.555544 -1.825888 -0.646522
C  7.481365 -0.107417 -0.8757
C  0.533006 -1.599683 1.637407
C  -4.60744 -0.754461 -0.829063
C  2.956121 -0.103307 1.255166
C  4.218337 0.690255 1.151304
C  5.82929 2.359124 -1.734284
C  1.373899 -1.258678 2.743899
C  0.931358 -1.168943 0.334344
C  2.549898 -0.525311 2.551733
C  2.121901 -0.441998 0.156586
C  -4.643851 0.09844 -1.970044
C  -6.478291 0.355734 0.042479
C  -6.482956 1.195758 -1.114781
C  8.774847 -0.811484 -0.519199
C  -7.528805 0.555257 1.115532
C  -8.412277 2.341212 -0.222055
H  -1.979522 -0.584208 0.241855
H  -3.167521 -1.221625 1.405355
H  5.794773 2.684997 0.393375
H  8.040899 1.862668 -0.113289
H  7.197564 0.836917 1.070181
H  -1.110684 -2.997614 -0.089653
H  -2.22225 -3.517457 1.18968
H  -4.066855 -2.778142 -0.404602
H  -2.997849 -1.975514 -1.590841
H  6.656089 -0.838496 -0.775382
H  7.528422 0.149484 -1.952509
H  -0.865943 -2.549518 2.825066
H  4.199915 0.684997 -0.969559
H  1.086669 -1.575885 3.754394
H  0.310744 -1.395994 -0.537652
H  3.18801 -0.251984 3.39855
H  2.370094 -0.123981 -0.86382
H  -3.910112 -0.006164 -2.775875
H  -7.425453 2.770244 -2.077969
H  6.76644 3.637039 -2.89666
H  9.836601 -2.368064 -1.09323
H  -9.375803 3.950194 -1.208312
H  -10.035658 3.441767 0.344056
