program: Gaussian 09
title: 000264913
version: EM64L-G09RevD.01
frameworkgroup: C1[X(C8H7ClN2O2)]
method: RPBEPBE
basis: SDD
operation: Freq
keyword: #p
keyword: freq=noraman
keyword: PBEPBE/SDD
title: #p freq=noraman PBEPBE/SDD
converged: NO YES NO NO
title: Mulliken charges:
elementType: Cl O O N N C C C C C C C C H H H H H H H
charge: -0.014590 -0.178035 -0.185870 -0.279291 0.126428 0.527215 -0.274870 -0.298537 -0.216037 -0.213067 0.200816 -0.216738 -0.763063 0.259312 0.263274 0.242755 0.242706 0.265587 0.250836 0.261168
chargesum: 0.00000
title: Mulliken charges with hydrogens summed into heavy atoms:
elementType: Cl O O N N C C C C C C C C
charge: -0.014590 -0.178035 -0.185870 -0.279291 0.126428 0.527215 -0.274870 -0.039225 0.047237 0.029689 0.200816 0.025968 0.014528
polarizability: 1.44451322e+02 -7.64081062e+00 1.10750547e+02 -5.33021745e+00 2.23588155e+00 8.96622004e+01
1716.lowfreq: -8.8256 -5.9356 -0.0017 0.0020 0.0023 6.2002 19.9099 56.5256 80.9092
frequency: 19.7699 56.5090 80.9067 100.1312 137.5663 152.1746 177.1087 216.7701 271.8707 290.4475 343.1645 370.3076 411.7113 450.0484 490.7099 508.7619 556.5937 572.9313 608.9421 655.6187 706.3485 725.5575 756.7235 826.9197 873.7655 952.5009 973.6152 990.9763 1006.5775 1024.3245 1036.6116 1052.7411 1123.9126 1170.2398 1176.2252 1248.3887 1277.6246 1369.8085 1381.2094 1417.4598 1428.2404 1446.2887 1458.3774 1461.9362 1574.6335 1595.5051 1652.9865 2998.4936 3087.7211 3132.9941 3143.6102 3153.7485 3168.1936 3180.3029
redmass: 12.2593 4.5514 5.2611 6.5317 1.0971 4.5174 7.1164 12.2374 7.9658 4.9066 12.4841 4.5719 7.8077 3.5223 5.5058 4.5747 5.4694 3.6764 4.5958 6.8302 4.7667 7.8560 1.2973 3.1491 1.5611 1.3996 3.4128 1.3570 2.8601 4.0990 1.6936 2.3735 1.6200 1.7652 1.4495 1.7055 3.1264 10.3419 1.2287 4.0011 3.1398 1.0847 2.5861 1.0597 6.4320 7.0712 9.6747 1.0370 1.0973 1.1002 1.0863 1.0910 1.0954 1.1004
irintensity: 0.1075 4.6200 0.7353 0.3383 0.0979 0.4962 0.0901 0.0735 1.7422 5.2258 0.9769 13.1617 3.4347 16.1722 5.0214 2.4199 14.6845 7.3608 35.0122 32.8387 32.2073 127.1048 28.8698 140.4687 9.9905 0.9674 115.5489 0.2494 17.7520 26.2585 8.9961 35.6781 3.8983 131.8808 81.9732 36.1387 76.3283 0.7256 63.3991 69.3027 46.4279 19.3560 57.2290 29.2092 5.2446 1.9377 220.4705 1.6675 4.6418 9.8281 0.5241 6.0616 6.4628 9.1309
temp: 298.150 k
press: 1.00000 atm
elementType: 17 8 8 7 7 6 6 6 6 6 6 6 6 1 1 1 1 1 1 1
symmnumber: 1
zpe: 359158.5 jmol-1
zpe.correction: 0.136796 hartree
zpe.thermalcorrener: 0.149382 hartree
zpe.thermalcorrenthalpy: 0.150326 hartree
zpe.thermalcorrgfe: 0.096198 hartree
zpe.sumelectzpe: -1028.049375 hartree
zpe.sumelectthermal: -1028.036789 hartree
zpe.sumelectthermalent: -1028.035845 hartree
zpe.sumelectthermalfe: -1028.089973 hartree
dipole: 5.4720 -0.0313 -3.9359
dipole: 6.7405
quadrupole: -85.7860 -77.2455 -84.3702
quadrupole: -3.0605 1.3320 4.3807
quadrupole: -3.3187 5.2217 -1.9030 -3.0605 1.3320 4.3807
hfenergy: -1028.1861713 hartree
pointgroup: C01 [X(C8H7Cl1N2O2)]
dipole: -2.2050083 1.3306772 0.6323936 debye
dipolederiv: -0.213406 -0.0240236 0.2468531 -0.031837 -0.0599808 0.0468871 0.2116079 0.0491428 -0.5782263 -1.1732147 -0.2232823 -0.0254401 -0.0099955 -0.4893075 -0.0105721 0.0182617 0.0061406 -0.2810385 -0.0472576 -0.7796567 0.0074874 0.0346402 -1.041645 0.0109046 0.0242521 0.0127752 -0.1057226 -0.7339369 0.1810062 0.0150553 -0.4233732 -1.6252973 -0.0115355 0.00714 -0.0173163 -0.1323599 -0.1182184 0.1306034 -0.0242427 -0.2268252 1.9300611 -0.0095909 -0.016993 0.0145487 -0.0337927 0.4781184 -0.1232233 0.1250789 -0.0151864 -0.1266194 0.0084478 0.0454914 0.0319055 -0.0306085 0.2173214 0.0703408 -0.4596142 -0.0007095 -0.0354762 -0.0812462 -0.3028914 -0.1028816 0.8275726 -0.0484831 0.0087752 0.0073796 -0.0674134 -0.0835997 -0.0283726 0.0151273 -0.0097731 0.0178432 -0.1365935 -0.0219968 0.209273 -0.013135 -0.083308 -0.0060181 0.1351861 0.0138654 -0.1629849 -0.0692875 0.0278861 -0.1276291 0.0027662 -0.1235192 -0.0223353 -0.0889091 -0.0259197 0.0427599 1.6599551 0.6092709 0.0355155 0.6389339 1.4591311 0.0445564 -0.0270858 -0.0222982 0.1869192 0.1111846 -0.0254197 0.0136451 -0.0130162 -0.1327431 -0.029328 -0.0109657 -0.0339182 0.0682738 -0.0939347 0.1865341 -0.014908 0.052061 -0.3991587 -0.0017313 -0.0169081 0.0237874 0.0014033 0.046467 0.0140732 -0.0648097 0.0279439 0.1268867 0.0248061 -0.0571008 0.0174747 0.0018594 0.0622502 0.0201127 -0.0415061 0.0204253 0.1568369 0.028327 -0.0597974 0.0269777 0.004704 0.0346793 0.0065685 0.0704981 -0.0016103 0.1594538 0.0226326 0.084655 0.0207795 -0.0431207 -0.0901543 0.0232201 0.0130149 0.0252997 0.1546545 0.0100441 0.0109979 0.0092938 0.0820235 -0.0181409 -0.1182696 -0.0130821 -0.0602502 0.0138519 -0.0112669 -0.0073529 -0.0192655 0.1310118 0.0505049 0.0159928 0.1004915 0.0235578 0.0897655 0.0356673 0.1105957 -0.0183112 0.0050962 0.0821467 0.0214881 -0.0730606 0.0377239 0.1100132 -0.020276 -0.0753106 0.0229926 -0.0016127 unknown
polarizability: 144.5428318|0.1953867|91.3867163|-8.8387909|-6.6161223|108.9345215 unknown
InChI: InChI=1S/C8H7ClN2O2/c1-6(12)11(10-13)8-5-3-2-4-7(8)9/h2-5H,1H3
charge 0 multiplicity 1
20 atoms
Cl -0.195858 0.309243 -2.535326
O  3.323407 0.614988 0.162318
O  0.832608 -2.493577 0.216671
N  1.122198 -0.227395 0.213464
N  1.697973 -1.58111 0.196023
C  -0.303272 -0.034258 0.244619
C  -1.053129 0.188708 -0.935543
C  -0.994009 -0.149063 1.476425
C  -2.452522 0.329385 -0.902176
C  -2.396837 -0.014469 1.525645
C  2.097268 0.847635 0.187562
C  -3.124542 0.227059 0.337487
C  1.497336 2.243913 0.195533
H  -0.416028 -0.346419 2.385412
H  -3.005493 0.508119 -1.828616
H  -2.919745 -0.103801 2.482963
H  -4.213991 0.330275 0.368052
H  2.321237 2.968371 0.272742
H  0.798313 2.385053 1.038158
H  0.938786 2.431843 -0.739113
