program: Gaussian 09
title: 000264928
version: EM64L-G09RevD.01
frameworkgroup: C1[X(C10H16N4O3)]
method: RPBEPBE
basis: SDD
operation: Freq
keyword: #p
keyword: freq=noraman
keyword: PBEPBE/SDD
title: #p freq=noraman PBEPBE/SDD
converged: YES YES NO NO
title: Mulliken charges:
elementType: O O O N N N N C C C C C C C C C C H H H H H H H H H H H H H H H H
charge: -0.293457 -0.289611 -0.269429 -0.415241 -0.356394 -0.394590 -0.637373 -0.151262 -0.024474 0.079655 -0.077464 -0.709344 -0.725048 0.093553 0.368256 -0.784508 0.306413 0.249875 0.227995 0.314276 0.240670 0.220058 0.210919 0.205253 0.227526 0.214482 0.281284 0.312632 0.221672 0.385232 0.312509 0.348325 0.307610
chargesum: 0.00000
title: Mulliken charges with hydrogens summed into heavy atoms:
elementType: O O O N N N N C C C C C C C C C C
charge: -0.293457 -0.289611 -0.269429 -0.100964 0.028838 -0.082081 0.018562 0.098613 0.203521 0.079655 -0.077464 -0.037697 -0.077787 0.093553 0.368256 0.031080 0.306413
polarizability: 2.17634494e+02 4.13435516e+00 1.33081837e+02 -7.65916874e-01 9.61694502e+00 1.10076221e+02
1716.lowfreq: -4.1083 -0.0006 -0.0002 0.0004 4.1161 10.0956 27.0541 53.0080 59.8056
frequency: 27.0194 52.9472 59.7565 65.8723 77.2076 104.5510 111.5146 147.2581 171.9629 186.4527 203.8596 226.1374 228.9976 230.8117 263.9278 274.4913 302.3795 310.6434 324.8838 371.9100 385.4116 428.2816 465.2603 492.4503 496.9433 508.5837 517.3152 556.8509 582.8719 619.7171 659.2438 668.3124 710.3635 728.3949 739.3136 792.2368 821.4936 877.1990 890.5849 918.7315 924.4281 958.1127 977.0878 1017.5109 1038.5791 1044.6255 1050.6072 1074.0323 1112.8288 1129.8452 1183.6320 1200.0728 1224.4204 1251.9140 1257.6390 1285.4398 1306.7379 1317.4980 1344.9075 1368.3687 1382.6659 1389.6442 1400.3428 1403.6645 1447.5077 1457.6112 1466.2854 1472.1122 1477.6039 1483.7126 1488.2722 1497.5679 1578.3915 1604.2157 1634.2115 1645.6425 1671.6152 2958.1636 2967.2852 2983.0989 2984.3823 2991.4800 3058.4981 3069.6024 3071.6049 3079.2512 3082.5730 3110.5733 3112.2589 3524.4830 3544.0274 3587.0878 3696.1692
redmass: 5.1077 5.2676 4.0735 4.1065 3.2077 4.8282 3.2902 4.0464 1.2064 3.0060 1.0756 1.4152 3.1483 1.2735 3.1561 4.8445 3.9261 3.4573 6.2231 5.9428 2.4488 4.1211 1.2414 1.3303 1.4528 1.7732 3.6418 3.4044 7.3324 3.8927 4.3943 6.1513 7.9084 7.3302 5.0337 5.0157 3.3815 1.4654 2.1959 2.2240 1.2821 1.4925 2.3946 1.9198 2.4086 2.1965 1.6023 2.4230 2.2120 1.6972 1.9340 2.8598 2.6020 2.1177 2.9381 1.9395 2.1470 1.5244 1.5155 1.8316 1.2266 1.4229 1.2997 2.0878 1.1590 1.9126 1.0463 1.0531 1.1094 1.0467 1.0596 2.9723 5.6957 1.2454 2.9594 4.9916 4.9273 1.0824 1.0362 1.0359 1.0368 1.0842 1.0990 1.0958 1.0993 1.0991 1.0997 1.0888 1.1005 1.0762 1.0477 1.0789 1.1041
irintensity: 3.9695 16.0016 3.2672 0.8237 0.7123 0.3017 3.9812 3.2184 0.7966 1.4212 0.2234 3.4248 5.7965 5.2434 3.5167 5.9334 8.2910 8.1249 3.4285 16.0349 5.4321 16.3452 340.0270 100.6460 44.9179 79.0453 9.9238 6.2917 1.8995 10.7729 7.5671 7.3827 16.7154 13.0702 4.3060 23.8188 5.9963 84.0870 41.9172 33.3804 0.5112 0.4013 15.9870 11.0358 0.1592 7.4754 6.6823 62.6894 3.8588 19.6155 32.5861 25.0331 14.7769 51.6793 37.0981 54.9696 359.2259 3.7691 5.7424 27.6143 12.3964 127.1525 20.4716 8.3740 115.8398 201.1991 1.7354 11.4709 44.4389 16.1951 8.1906 68.5775 206.1471 114.1978 295.0311 579.0720 253.2775 27.1045 40.8850 18.2227 12.1807 9.7509 39.6865 12.6501 17.4960 61.4192 31.4164 121.3536 3.2441 25.5902 47.1647 36.0944 44.4837
temp: 298.150 k
press: 1.00000 atm
elementType: 8 8 8 7 7 7 7 6 6 6 6 6 6 6 6 6 6 1 1 1 1 1 1 1 1 1 1 1 1 1 1 1 1
symmnumber: 1
zpe: 693786.4 jmol-1
zpe.correction: 0.264249 hartree
zpe.thermalcorrener: 0.282725 hartree
zpe.thermalcorrenthalpy: 0.283669 hartree
zpe.thermalcorrgfe: 0.217411 hartree
zpe.sumelectzpe: -834.071670 hartree
zpe.sumelectthermal: -834.053194 hartree
zpe.sumelectthermalent: -834.052250 hartree
zpe.sumelectthermalfe: -834.118508 hartree
dipole: 3.9667 -1.6522 -3.2651
dipole: 5.3968
quadrupole: -52.8778 -115.9364 -103.6639
quadrupole: 0.2636 -10.5882 -3.2504
quadrupole: 37.9482 -25.1104 -12.8379 0.2636 -10.5882 -3.2504
hfenergy: -834.3359188 hartree
pointgroup: C01 [X(C10H16N4O3)]
dipole: -1.5981438 -0.4815505 1.3123834 debye
polarizability: 216.6071579|-10.1992127|133.2399067|-1.4089233|-10.4928621|110.9454875 unknown
InChI: InChI=1S/C10H16N4O3/c1-4(2)7-8(15)6(9(16)12-7)5(3)13-14-10(11)17/h4,7,12-14H,11H2,1-3H3
charge 0 multiplicity 1
33 atoms
O  0.457744 -1.389008 1.365822
O  1.341066 2.906034 -0.695545
O  -3.209891 -0.530615 -1.530017
N  2.671296 1.092971 0.034375
N  -1.764568 0.02314 0.832301
N  -3.15635 0.014863 0.756031
N  -5.197434 -0.465395 -0.300038
C  2.556431 -0.238917 0.653092
C  3.158901 -1.414231 -0.179907
C  1.032199 -0.364075 0.840601
C  0.399643 0.824512 0.313277
C  2.550886 -1.499418 -1.597122
C  4.700885 -1.309623 -0.230156
C  1.454342 1.749275 -0.185175
C  -0.994477 1.014825 0.271388
C  -1.654633 2.208472 -0.359607
C  -3.818079 -0.351038 -0.440514
H  3.038349 -0.249256 1.654305
H  2.881365 -2.330778 0.37979
H  3.557907 1.539406 -0.196681
H  1.458324 -1.658008 -1.562465
H  2.743655 -0.572209 -2.167309
H  2.996883 -2.34276 -2.155013
H  5.024655 -0.416856 -0.800098
H  5.13362 -2.192215 -0.735098
H  5.140174 -1.250053 0.783795
H  -2.124213 1.900411 -1.312765
H  -0.897043 2.978732 -0.569166
H  -2.453564 2.6108 0.288363
H  -1.251376 -0.828554 1.164732
H  -3.662144 0.184788 1.627173
H  -5.725918 -0.685955 -1.14034
H  -5.690232 -0.392066 0.587368
