program: Gaussian 09
title: 000264910
version: EM64L-G09RevD.01
frameworkgroup: C1[X(C9H9ClN2O2)]
method: RPBEPBE
basis: SDD
operation: Freq
keyword: #p
keyword: freq=noraman
keyword: PBEPBE/SDD
title: #p freq=noraman PBEPBE/SDD
converged: NO YES NO NO
title: Mulliken charges:
elementType: Cl O O N N C C C C C C C C C H H H H H H H H H
charge: -0.017965 -0.160813 -0.192246 -0.302163 0.079573 0.474570 0.449885 -0.340927 -0.319063 -0.377477 -0.371725 -0.801173 0.288763 -0.694269 0.251014 0.256448 0.238508 0.239113 0.229699 0.229158 0.242812 0.300434 0.297841
chargesum: 0.00000
title: Mulliken charges with hydrogens summed into heavy atoms:
elementType: Cl O O N N C C C C C C C C C
charge: -0.017965 -0.160813 -0.192246 -0.302163 0.079573 0.474570 0.449885 -0.089913 -0.062615 -0.138968 -0.132612 -0.099505 0.288763 -0.095993
polarizability: 1.86022182e+02 4.97498245e+00 1.31654030e+02 5.40642479e+00 -7.76840016e+00 7.82267247e+01
1716.lowfreq: -31.3301 -7.7539 0.0013 0.0019 0.0023 3.9781 5.3560 34.8545 53.0463
frequency: -30.4023 34.8416 53.0442 59.1445 89.0481 126.2430 160.5888 185.7611 237.3016 244.6307 252.1962 317.8187 354.3143 402.6218 435.6034 443.3612 473.2368 509.1059 567.9559 633.7353 658.0518 695.3913 722.7096 729.9921 795.9643 811.7761 834.5827 891.8823 914.4333 942.8356 968.3483 975.0781 992.8038 1011.6269 1046.7173 1119.1845 1129.5084 1153.3920 1195.8532 1224.6018 1248.6566 1290.3571 1311.5422 1374.9631 1398.6870 1404.4291 1411.4326 1416.0135 1469.6041 1474.4069 1497.9867 1585.2158 1617.1421 1652.8645 2979.8859 3062.1129 3073.4798 3091.8834 3134.6446 3136.8776 3148.7000 3170.7808 3174.3941
redmass: 1.0216 7.0132 5.6544 5.6894 2.7466 6.9326 6.9994 6.8641 9.9259 7.7217 9.0715 4.1056 3.4277 2.8353 7.2191 6.3271 8.2190 2.8662 3.2725 6.5588 5.8541 5.6253 4.1117 6.8942 4.8555 1.5923 1.2561 5.4666 1.8994 1.5822 1.4188 2.8887 1.5656 2.9792 1.5802 3.5147 1.3075 1.0987 1.1229 2.7492 2.1639 2.3803 1.2983 5.6316 1.2195 5.5278 1.1250 4.2959 1.1039 1.0575 2.5789 6.4922 6.3200 11.0059 1.0391 1.0945 1.0577 1.1000 1.0897 1.0898 1.1070 1.0954 1.0965
irintensity: 0.6964 0.1187 0.1935 1.2842 10.7790 1.5741 2.2625 3.8912 4.2847 1.2374 2.2026 1.3568 0.8995 0.2929 13.6695 1.6507 14.0284 18.8560 0.4686 0.1641 13.7960 74.1063 99.6511 52.0090 9.7012 21.9304 1.0472 147.8148 7.4477 3.2636 0.9628 23.0962 5.7900 2.4184 21.7434 80.8873 18.7354 0.4027 2.1757 6.6638 31.6513 52.9679 4.1805 4.2072 15.0479 156.0978 22.6919 73.7767 12.4191 12.7877 34.2093 0.8486 24.2147 78.7577 24.5258 19.7456 11.0652 15.9891 12.2437 15.1191 0.3923 7.0411 0.2207
temp: 298.150 k
press: 1.00000 atm
elementType: 17 8 8 7 7 6 6 6 6 6 6 6 6 6 1 1 1 1 1 1 1 1 1
symmnumber: 1
zpe: 433774.0 jmol-1
zpe.correction: 0.165216 hartree
zpe.thermalcorrener: 0.178291 hartree
zpe.thermalcorrenthalpy: 0.179235 hartree
zpe.thermalcorrgfe: 0.123882 hartree
zpe.sumelectzpe: -1067.279636 hartree
zpe.sumelectthermal: -1067.266562 hartree
zpe.sumelectthermalent: -1067.265617 hartree
zpe.sumelectthermalfe: -1067.320971 hartree
dipole: -3.5299 0.6199 0.1355
dipole: 3.5865
quadrupole: -80.8052 -97.0769 -84.7988
quadrupole: 9.7647 3.1676 -7.7243
quadrupole: 6.7551 -9.5166 2.7615 9.7647 3.1676 -7.7243
hfenergy: -1067.4448522 hartree
pointgroup: C01 [X(C9H9Cl1N2O2)]
dipole: -1.3692704 0.3121094 0.1367848 debye
dipolederiv: -0.4274936 0.138628 0.0500177 0.2827352 -0.2341509 -0.0381529 0.0845955 -0.0324977 -0.146246 -0.5566099 -0.0529285 -0.0241922 0.1849795 -0.8061606 -0.220654 0.1050585 -0.184228 -0.3343891 -0.1198123 0.7510466 0.2901261 -0.1457383 -0.9680324 -0.2942546 -0.0888406 -0.3162858 -0.2369525 -0.5243748 0.1192774 0.0363242 0.3076236 -1.1251106 -0.3483716 0.0687356 -0.3401074 -0.2067008 -0.2956819 -0.2877614 -0.0986308 0.3121603 1.5293058 0.5783613 0.1562615 0.5745334 0.1714823 0.2444551 -0.0065158 0.0064648 0.063299 -0.0922674 -0.1393052 0.0229483 -0.05737 0.0689343 0.5004696 0.1232354 0.0340433 0.189708 0.0604832 0.0045479 0.072279 -0.0111928 -0.0056976 0.0677325 0.112049 0.0062946 -0.0258923 -0.0170728 -0.0674022 0.0811541 -0.0234224 -0.0505206 0.0627591 -0.0655406 0.026939 0.0668503 0.0374551 -0.0334463 -0.0494852 -0.0316721 -0.0545075 -0.2183569 -0.1655565 0.0653178 -0.2280154 -0.083007 -0.101026 0.1513054 -0.050008 -0.0797979 -0.2880429 0.0442761 -0.0423703 0.1011401 0.0487356 -0.1130429 -0.1142796 -0.1148435 -0.1066369 -0.1762148 -0.0662899 -0.0184776 -0.1468865 0.0340425 -0.0149356 -0.1303218 -0.0446924 0.0566944 1.345317 -0.4620375 -0.1952421 -0.4561506 1.0964545 0.3815515 -0.1719934 0.2954982 0.315331 0.2209297 -0.323387 -0.1044447 -0.6652062 0.3273238 0.0686543 -0.2150307 0.0642802 0.158014 0.0724739 -0.0649188 0.0273974 -0.0640029 0.0210744 0.0829982 0.0174545 0.0377172 0.0888241 0.0272222 0.0585812 -0.0576165 0.0600112 0.0734533 0.0612801 -0.0506111 0.0340875 0.0950302 -0.0223321 0.0644639 -0.0719827 0.0722149 0.0493136 0.0837565 -0.0604973 0.0777802 0.0864402 0.037796 -0.0696563 0.0322264 -0.0750088 -0.0133045 0.0967432 0.0296029 0.0953037 0.0888213 0.0273126 -0.0155491 0.0114006 -0.0401518 0.0565414 0.1015719 0.107801 0.1008097 -0.0571912 -0.0151266 0.0456148 -0.0050134 0.1448473 -0.0629989 0.0251661 -0.0007732 0.0437904 0.1065668 -0.0049657 -0.0381723 -0.0195889 -0.0627367 0.0259919 -0.1062746 -0.051662 -0.1091361 -0.0192403 0.0228882 0.0850263 0.0145121 0.0692873 -0.0112014 0.0471398 0.0167375 0.0430825 0.0650585 0.0196555 0.0761149 0.0364953 0.0549328 0.0531313 -0.0549049 0.0195614 -0.0514265 -0.0033167 unknown
polarizability: 186.6297899|1.2836483|132.4150018|1.4451428|-1.7398355|76.8581449 unknown
InChI: InChI=1S/C9H9ClN2O2/c1-7-2-4-8(5-3-7)12(11-14)9(13)6-10/h2-5H,6H2,1H3
charge 0 multiplicity 1
23 atoms
Cl 4.727274 -1.287656 -0.522476
O  1.745901 -1.641345 -0.618196
O  0.723895 2.628881 0.807106
N  1.032803 0.476041 0.077794
N  1.575812 1.752641 0.49224
C  -0.378571 0.165538 0.0368
C  -3.157827 -0.424441 -0.013533
C  -1.263786 1.009984 -0.673935
C  -0.870817 -0.967631 0.727139
C  -2.640624 0.709901 -0.691267
C  -2.249135 -1.254379 0.694156
C  -4.636897 -0.757555 -0.066925
C  2.053762 -0.491006 -0.250019
C  3.48722 0.037647 -0.104837
H  -0.885255 1.885821 -1.208027
H  -0.182633 -1.620997 1.270595
H  -3.324598 1.367384 -1.239958
H  -2.625257 -2.136034 1.225556
H  -4.971217 -1.270561 0.851529
H  -5.25352 0.148448 -0.197993
H  -4.857462 -1.431523 -0.91749
H  3.673652 0.879391 -0.786344
H  3.69418 0.361153 0.924583
