program: Gaussian 09
title: 000264908
version: EM64L-G09RevD.01
frameworkgroup: C1[X(C8H7N3O4)]
method: RPBEPBE
basis: SDD
operation: Freq
keyword: #pfreq=noraman
keyword: PBEPBE/SDD
title: #p freq=noraman PBEPBE/SDD
converged: NO YES NO NO
title: Mulliken charges:
elementType: O O O O N N N C C C C C C C C H H H H H H H
charge: -0.198725 -0.199348 -0.196992 -0.183387 -0.306163 0.022230 0.098614 0.530543 -0.473757 0.395652 -0.328740 -0.365758 -0.174583 0.234999 -0.744159 0.309337 0.270572 0.293318 0.247619 0.251614 0.257294 0.259820
chargesum: 0.00000
title: Mulliken charges with hydrogens summed into heavy atoms:
elementType: O O O O N N N C C C C C C C C
charge: -0.198725 -0.199348 -0.196992 -0.183387 -0.306163 0.022230 0.098614 0.530543 -0.164420 0.395652 -0.058167 -0.072441 0.073036 0.234999 0.024569
polarizability: 1.74022879e+02 3.21430323e+00 1.36832137e+02 4.93093125e-01 2.76959782e+00 7.34182606e+01
1716.lowfreq: -4.1967 -0.0009 -0.0008 -0.0006 4.9519 7.1651 36.3617 52.9197 67.5804
frequency: 36.3602 52.9177 67.5788 95.1756 117.1485 145.5498 168.3119 199.2017 218.5624 248.2246 294.3741 321.2557 379.3845 419.9764 426.9850 438.1467 504.7448 520.0181 533.1075 594.9123 629.1866 652.8804 680.8565 702.2510 723.1341 810.1445 815.3653 869.3043 925.7165 944.1683 985.8264 990.4149 1000.5533 1037.0745 1039.7156 1086.9363 1091.1471 1177.9029 1179.5810 1219.5519 1279.6001 1290.8384 1375.7592 1389.1928 1396.0958 1408.4640 1439.1886 1445.0784 1454.8045 1471.8537 1591.0884 1608.9777 1637.9896 3013.8485 3102.5543 3140.1057 3160.0374 3184.1207 3191.7920 3195.2059
redmass: 8.3922 11.8698 4.2126 6.5161 10.5716 1.0329 5.6401 8.2295 9.1341 7.0060 6.4727 4.0831 7.1049 6.0457 4.3359 8.2886 5.5476 5.5084 5.0089 3.6349 5.3895 7.8843 2.4956 5.1399 10.8825 1.5275 8.1167 3.3575 1.6825 1.4195 4.2111 5.9779 1.3791 1.6917 2.1582 1.9689 1.5593 1.7916 1.6948 8.9043 5.2196 1.3683 10.3505 1.2246 7.8984 12.6074 3.0156 1.0749 1.0478 2.7075 6.9292 7.1332 9.2385 1.0366 1.0967 1.1018 1.0887 1.0930 1.0975 1.0946
irintensity: 0.5328 0.0386 5.1869 1.9216 3.2031 0.3460 2.6788 4.1214 7.7738 0.1686 0.2428 5.8160 1.3528 4.0042 5.0013 11.7367 21.2696 1.4939 6.6413 1.1898 51.6362 11.9187 41.6493 13.9093 74.9275 19.2293 59.8723 117.8911 24.1689 10.3887 21.1715 0.5120 3.4592 7.1875 8.2610 29.0897 31.3999 35.1229 87.1103 202.7048 224.4915 10.8506 73.8888 61.6697 27.9056 193.1798 11.9482 17.2475 20.2073 51.7113 2.3699 3.1355 96.1894 0.0719 3.7096 10.4627 6.5340 0.2885 0.8892 10.5894
temp: 298.150 k
press: 1.00000 atm
elementType: 8 8 8 8 7 7 7 6 6 6 6 6 6 6 6 1 1 1 1 1 1 1
symmnumber: 1
zpe: 389505.6 jmol-1
zpe.correction: 0.148355 hartree
zpe.thermalcorrener: 0.162053 hartree
zpe.thermalcorrenthalpy: 0.162997 hartree
zpe.thermalcorrgfe: 0.106758 hartree
zpe.sumelectzpe: -772.969607 hartree
zpe.sumelectthermal: -772.955909 hartree
zpe.sumelectthermalent: -772.954965 hartree
zpe.sumelectthermalfe: -773.011204 hartree
dipole: -4.1042 2.6968 1.2398
dipole: 5.0650
quadrupole: -91.6765 -88.2711 -88.0619
quadrupole: 11.1206 2.7310 8.4074
quadrupole: -2.3400 1.0654 1.2746 11.1206 2.7310 8.4074
hfenergy: -773.1179621 hartree
pointgroup: C01[X(C8H7N3O4)]
dipole: -1.6296136 1.0128716 0.5379887 debye
dipolederiv: -0.6348612 -0.021541 -0.0637817 0.1566135 -0.7492034 0.331385 -0.2430968 0.2342439 -0.4788702 -0.9049715 -0.1168462 0.0277027 -0.0507526 -0.4449576 -0.0925891 0.0687646 -0.0760526 -0.2642087 -0.5316445 0.0626948 0.0547991 0.0818976 -0.6952597 -0.2182683 0.0653493 -0.2030231 -0.3066461 -0.2203003 0.6828907 -0.4897308 -0.0063937 -0.5881643 0.2832459 0.0351658 0.5011115 -0.4299341 -0.8265958 0.0152542 -0.1946848 0.2401209 -0.9486293 0.5456338 -0.3233309 0.4680424 -0.4661397 1.5740841 -0.1463403 -0.2076923 -0.2814613 1.0243568 0.3957158 -0.2745638 0.3489799 0.3667195 -0.1349738 -0.4472804 0.2870195 -0.0262218 1.1883197 -0.7756615 -0.0597745 -0.8417047 0.5027665 0.4925126 0.2657622 -0.0244753 0.2914436 -0.0427048 0.1124491 0.0387132 0.0458808 0.0084567 0.0557616 -0.1086243 -0.1029631 0.1007837 -0.0477354 -0.0188931 -0.0593876 -0.0288496 -0.0487699 -0.404382 0.1459312 0.1481166 0.2540944 -0.1195412 -0.0888655 0.1224786 -0.117209 0.0160585 0.1079522 -0.1005279 -0.0014642 -0.02512 0.0207396 0.030554 0.0557516 0.0188965 -0.0392598 0.0260017 0.0248185 0.0060875 -0.2099633 0.0262279 0.0518572 -0.0931632 0.0483568 -0.0782477 -0.291707 0.0676561 0.0254715 0.0056621 0.158408 0.1047674 0.0543086 0.0843768 -0.1017435 1.5754732 -0.2038454 0.5308533 -0.3499259 0.8828389 -0.5163466 0.583449 -0.4270488 0.6154203 -0.3697525 -0.1710424 -0.0153914 -0.2653584 -0.1046471 -0.0122468 0.0431573 0.0101279 0.0178636 0.1561828 -0.0110075 0.0079833 -0.0491092 0.0776748 -0.0265784 0.0071013 0.005799 0.135717 0.016711 0.0527199 0.0372552 0.0549896 0.102656 -0.029451 0.0120805 -0.0010954 0.1266492 0.0617005 -0.0504231 -0.006905 -0.0178911 0.1288135 -0.0150706 -0.0019531 -0.0056008 0.1698089 0.0711928 -0.0135367 0.0052731 -0.0163372 -0.0477682 -0.0731568 0.0073116 -0.0674848 0.1287068 -0.0020986 0.0285051 -0.0550748 0.0913867 0.0525246 0.0664692 -0.0824102 0.0481472 0.0768907 0.0954808 -0.0108015 -0.0004448 -0.0101471 0.1229504 0.015768 0.0335953 0.0157313 -0.0454811 0.088234 0.0555842 0.0320461 0.0316894 0.0031008 -0.0707176 0.0104533 -0.0616252 0.0942431 unknown
polarizability: 173.8076605|4.2278746|136.9310656|-1.7455069|3.5591533|73.5345506 unknown
InChI: InChI=1S/C8H7N3O4/c1-6(12)10(9-13)7-3-2-4-8(5-7)11(14)15/h2-5H,1H3
charge 0 multiplicity 1
22 atoms
O  -2.790157 1.409729 -1.061259
O  4.250874 0.04272 -0.413063
O  2.948616 -1.744424 -0.972287
O  -1.118969 -2.165476 1.333982
N  -1.794953 -0.337907 0.123622
N  3.108242 -0.546312 -0.521337
N  -2.092067 -1.619303 0.747003
C  -0.499966 0.296164 0.192462
C  0.644428 -0.428851 -0.202742
C  1.897297 0.208027 -0.103671
C  -0.385727 1.623361 0.676229
C  2.043384 1.529547 0.368781
C  0.884126 2.233956 0.752673
C  -2.928121 0.281823 -0.531265
C  -4.224788 -0.501747 -0.527956
H  0.589434 -1.448406 -0.589726
H  -1.282251 2.172635 0.97392
H  3.04002 1.974735 0.424342
H  0.967922 3.262303 1.116399
H  -4.975656 0.0905 -1.071429
H  -4.574909 -0.69711 0.499593
H  -4.102279 -1.484964 -1.01257
