program: Gaussian 09
title: 000264929
version: EM64L-G09RevD.01
frameworkgroup: C1[X(C10H16N4O3S)]
method: RPBEPBE
basis: SDD
operation: Freq
keyword: #p
keyword: freq=noraman
keyword: PBEPBE/SDD
title: #p freq=noraman PBEPBE/SDD
converged: YES YES NO NO
title: Mulliken charges:
elementType: S O O O N N N N C C C C C C C C C C H H H H H H H H H H H H H H H H
charge: 0.171023 -0.289738 -0.287251 -0.268713 -0.413194 -0.356088 -0.394373 -0.637052 -0.136111 -0.334181 0.095202 -0.095781 0.099159 -0.694446 0.380192 -0.784951 -0.842476 0.307025 0.247601 0.248028 0.231858 0.315536 0.253674 0.244528 0.282611 0.312167 0.223004 0.386843 0.255627 0.254521 0.255375 0.313393 0.348860 0.308127
chargesum: 0.00000
title: Mulliken charges with hydrogens summed into heavy atoms:
elementType: S O O O N N N N C C C C C C C C C C
charge: 0.171023 -0.289738 -0.287251 -0.268713 -0.097657 0.030755 -0.080980 0.019935 0.111489 0.145705 0.095202 -0.095781 0.099159 -0.196244 0.380192 0.032831 -0.076952 0.307025
polarizability: 2.64375976e+02 -4.44359139e+00 1.48502804e+02 -1.63683450e+01 5.38867708e+00 1.12818029e+02
1716.lowfreq: -9.6695 -3.0373 -0.0010 0.0011 0.0015 1.3889 18.6220 26.7044 36.7177
frequency: 18.5884 26.6976 36.7047 53.2490 54.7652 66.9379 89.5257 103.9572 118.6243 136.8104 154.6855 156.9239 163.1636 192.7719 215.1325 225.3833 230.1392 279.0630 310.2955 315.1130 329.4699 370.5115 421.1951 442.7211 466.3669 490.4334 495.9083 505.7756 551.8578 582.4412 610.5871 643.3087 664.8592 668.4566 693.5273 710.2758 729.7096 747.7385 776.7197 795.6747 877.2623 888.1798 908.4836 958.6085 968.3817 977.9368 1019.3122 1039.7714 1045.2184 1051.5365 1063.7277 1070.3068 1099.4219 1151.9650 1188.8942 1213.3704 1243.5066 1253.2786 1270.9233 1279.4286 1307.0795 1322.7166 1331.1243 1349.0826 1369.0967 1391.0480 1405.2827 1447.2313 1449.9639 1450.8778 1457.9874 1460.9681 1465.2718 1478.5306 1498.5360 1579.5883 1605.4831 1635.0417 1646.3328 1672.3148 2958.9068 2984.7217 2986.9099 2998.9439 3002.6397 3048.4092 3069.1449 3076.2202 3110.2378 3113.8003 3122.1518 3128.4156 3524.9397 3543.8379 3586.7552 3695.5987
redmass: 3.6584 5.3897 6.5726 6.6813 4.6999 5.4316 2.4772 2.7643 3.8073 3.2870 4.4660 1.1336 1.2152 2.3512 3.6690 4.9189 1.9750 6.6024 3.4821 4.8695 4.7964 6.1116 5.1187 3.5772 1.2410 1.3692 1.1307 2.6126 3.3883 7.6476 4.1378 5.1933 6.6959 5.9291 5.1635 8.0071 5.7143 4.8921 1.8999 2.2377 1.4628 2.2161 2.5205 1.7505 1.5144 1.3949 2.1093 2.4689 2.2066 1.5990 2.3958 2.2997 2.5026 1.2811 1.8849 2.6735 1.7824 4.7233 1.4099 1.4336 2.1416 1.5059 1.3143 1.1835 1.9071 1.3939 2.3935 1.1582 1.0533 1.0863 1.9179 1.0552 1.0912 1.0958 3.1561 6.0269 1.2481 2.7042 5.6518 4.8912 1.0824 1.0369 1.0559 1.0300 1.0582 1.1057 1.0959 1.1063 1.1058 1.1017 1.0873 1.1021 1.0761 1.0478 1.0791 1.1041
irintensity: 2.6387 5.0270 2.2432 1.5762 16.5762 1.1131 0.9100 3.9128 1.7814 0.2525 0.9178 0.5041 0.8909 4.4770 10.0443 1.5589 5.0064 14.0725 5.9248 1.7763 17.0074 13.6232 22.0330 22.9169 319.8899 88.0168 136.7210 20.6211 1.7418 1.6874 11.4738 21.6785 1.9116 8.1439 3.2271 15.0278 1.8578 10.1021 2.8408 17.7347 78.6791 31.8922 47.6066 16.3118 8.5071 13.1602 3.2997 0.5497 7.2026 6.7768 18.7967 48.4628 7.9419 7.2545 70.8381 4.3037 65.9435 70.3892 10.9174 17.9766 377.9321 24.7199 12.9664 0.7697 27.4328 130.3021 15.2992 124.5535 16.6404 5.8943 221.2378 7.8882 9.5478 52.9286 61.5049 237.9494 114.3330 335.3508 590.6972 256.6222 22.0326 11.3437 27.9887 42.1554 12.3495 5.4510 11.0143 37.7714 23.2005 5.1075 124.4914 11.5242 26.6794 49.4164 35.3857 45.7911
temp: 298.150 k
press: 1.00000 atm
elementType: 16 8 8 8 7 7 7 7 6 6 6 6 6 6 6 6 6 6 1 1 1 1 1 1 1 1 1 1 1 1 1 1 1 1
symmnumber: 1
zpe: 696769.6 jmol-1
zpe.correction: 0.265386 hartree
zpe.thermalcorrener: 0.285891 hartree
zpe.thermalcorrenthalpy: 0.286835 hartree
zpe.thermalcorrgfe: 0.213370 hartree
zpe.sumelectzpe: -1232.046800 hartree
zpe.sumelectthermal: -1232.026295 hartree
zpe.sumelectthermalent: -1232.025351 hartree
zpe.sumelectthermalfe: -1232.098816 hartree
dipole: 2.6793 -2.5352 -2.1831
dipole: 4.2862
quadrupole: -63.7762 -128.3015 -114.3866
quadrupole: -23.2245 -27.3351 6.0504
quadrupole: 38.3786 -26.1468 -12.2318 -23.2245 -27.3351 6.0504
hfenergy: -1232.3121857 hartree
pointgroup: C01 [X(C10H16N4O3S1)]
dipole: 1.1096322 0.6486727 1.0916222 debye
polarizability: 264.2546961|-7.7658262|143.2981201|16.1096543|13.1624944|118.143993 unknown
InChI: InChI=1S/C10H16N4O3S/c1-5(13-14-10(11)17)7-8(15)6(3-4-18-2)12-9(7)16/h6,12-14H,3-4,11H2,1-2H3
charge 0 multiplicity 1
34 atoms
S  -5.625791 1.131237 1.044375
O  -0.042526 1.679081 0.184312
O  -0.29056 -3.10068 -0.568549
O  4.327411 0.297946 -1.182375
N  -1.788426 -1.288378 -0.808632
N  2.250099 0.38398 0.729486
N  3.603337 0.494341 1.045464
N  5.866055 0.806554 0.503308
C  -1.85776 0.172586 -0.637565
C  -2.948967 0.662518 0.348799
C  -0.436861 0.495421 -0.126299
C  0.320957 -0.733282 -0.061805
C  -0.549033 -1.861114 -0.491891
C  -4.369211 0.458132 -0.203371
C  1.671232 -0.798111 0.33475
C  2.483218 -2.062492 0.326527
C  -7.204216 0.696201 0.116286
C  4.588698 0.526996 0.029262
H  -2.002354 0.682211 -1.614303
H  -2.764828 1.736865 0.53858
H  -2.835001 0.127482 1.31022
H  -2.55986 -1.86308 -1.145517
H  -4.50539 0.999465 -1.157888
H  -4.593336 -0.613718 -0.358354
H  3.212875 -2.018289 -0.503811
H  1.819071 -2.925952 0.171384
H  3.055898 -2.173034 1.264644
H  1.664869 1.246388 0.622457
H  -8.04234 1.037727 0.743541
H  -7.276842 -0.393692 -0.030943
H  -7.236968 1.216789 -0.854541
H  3.829387 0.658398 2.028144
H  6.618656 0.802091 -0.180604
H  6.076205 1.062714 1.465608
