program: Gaussian 09
title: 000264914
version: EM64L-G09RevD.01
frameworkgroup: C1[X(C8H5Br3N2O2)]
method: RPBEPBE
basis: SDD
operation: Freq
keyword: #p
keyword: freq=noraman
keyword: PBEPBE/SDD
title: #p freq=noraman PBEPBE/SDD
converged: YES YES NO NO
title: Mulliken charges:
elementType: Br Br Br O O N N C C C C C C C C H H H H H
charge: 0.082290 0.081915 0.071317 -0.172899 -0.171653 -0.286018 0.147021 0.599007 -0.310308 -0.309876 -0.156635 -0.156492 -0.229742 0.219277 -0.762875 0.282509 0.282480 0.269871 0.260252 0.260558
chargesum: 0.00000
title: Mulliken charges with hydrogens summed into heavy atoms:
elementType: Br Br Br O O N N C C C C C C C C
charge: 0.082290 0.081915 0.071317 -0.172899 -0.171653 -0.286018 0.147021 0.599007 -0.310308 -0.309876 0.125874 0.125987 -0.229742 0.219277 0.027807
polarizability: 2.17680732e+02 -4.96598687e-02 1.67789830e+02 2.60431334e-01 2.08761553e-01 9.79316970e+01
1716.lowfreq: -7.6040 -5.5054 -0.0003 -0.0002 0.0001 6.5642 28.0531 33.9875 57.9507
frequency: 27.9972 33.9830 57.9463 81.5694 87.4465 112.2843 112.5572 143.0128 146.3538 158.8183 176.5721 222.2154 223.8392 273.4512 311.1513 355.3976 356.8209 367.5886 455.6005 506.6997 528.5826 533.5087 572.8147 578.6721 625.3484 696.4774 710.1346 744.5724 828.1674 865.9007 877.2163 967.9181 997.2193 1035.7593 1061.5118 1094.9992 1171.3421 1186.0330 1264.5572 1333.5571 1357.6317 1381.5487 1399.6140 1435.9618 1445.3668 1463.6469 1529.6623 1555.4105 1658.0178 2997.3282 3085.7304 3133.4813 3186.0981 3188.0864
redmass: 14.8161 13.8077 5.6228 5.4939 11.3513 23.9556 39.8588 1.0750 6.4940 12.0820 4.3480 73.9506 11.8617 11.1476 13.0000 7.2301 5.2224 6.9657 8.9761 5.0621 4.2696 5.3310 4.6757 4.2732 6.3510 5.6674 10.2699 9.4981 7.3891 1.4511 1.3689 4.1514 2.7166 1.6778 4.5589 2.5995 3.1396 1.6424 4.5442 4.3479 4.4171 1.2311 3.3692 8.1247 1.0929 1.0472 9.5674 8.1295 9.8698 1.0371 1.0977 1.0999 1.0932 1.0941
irintensity: 0.0249 0.7069 5.1208 0.2526 0.5035 0.0123 0.0203 0.0241 0.5552 0.2338 0.0016 0.0329 0.0117 1.0800 1.2652 3.5152 4.1056 27.6322 9.1724 0.1279 0.9379 27.1334 0.4282 7.1105 101.7163 71.8559 65.6594 110.3739 93.5756 35.1863 0.0078 102.1099 21.6477 6.5745 28.8315 30.9647 199.2951 15.3820 92.4073 16.8707 43.5612 64.8726 138.6778 76.5298 39.1399 18.6104 91.4041 98.6430 232.7926 1.9191 3.6200 9.1189 1.5368 0.4328
temp: 298.150 k
press: 1.00000 atm
elementType: 35 35 35 8 8 7 7 6 6 6 6 6 6 6 6 1 1 1 1 1
symmnumber: 1
zpe: 303272.4 jmol-1
zpe.correction: 0.115510 hartree
zpe.thermalcorrener: 0.131523 hartree
zpe.thermalcorrenthalpy: 0.132467 hartree
zpe.thermalcorrgfe: 0.068105 hartree
zpe.sumelectzpe: -607.018806 hartree
zpe.sumelectthermal: -607.002793 hartree
zpe.sumelectthermalent: -607.001849 hartree
zpe.sumelectthermalfe: -607.066211 hartree
dipole: -4.2264 -0.0176 -3.1777
dipole: 5.2878
quadrupole: -131.4815 -106.4474 -116.4734
quadrupole: 0.0538 -5.4063 -0.1143
quadrupole: -13.3474 11.6867 1.6607 0.0538 -5.4063 -0.1143
hfenergy: -607.1343161 hartree
pointgroup: C01 [X(C8H5Br3N2O2)]
dipole: -1.6579487 0.0689988 1.2547349 debye
dipolederiv: -0.1369352 -0.2581781 0.0166113 -0.23401 -0.4967257 0.0388305 0.0106662 0.0303941 0.0149673 -0.1375402 0.2597053 -0.0140014 0.2341865 -0.4973131 0.0206424 -0.0153629 0.0282074 0.0163211 -0.7709655 0.0013736 0.0323394 0.0016894 -0.0466261 0.003122 0.0374057 0.0029815 0.0082974 -1.1668267 -0.0250493 -0.2507667 -0.0155038 -0.2644949 -0.0155501 -0.0510593 -0.0130062 -0.4920589 0.0510115 -0.0505789 -0.7529269 0.0046815 -0.0979424 -0.0684167 0.0877939 -0.0653578 -1.043784 -0.7859612 0.0106296 0.2284851 -0.0287393 -0.136741 -0.1011743 -0.3720272 -0.1029057 -1.6237769 -0.1516321 0.0038916 0.0628247 -0.0265385 -0.0216509 0.1358659 -0.3821155 0.1333042 1.9182116 0.3397186 -0.0051311 -0.0843108 0.0047626 -0.4064174 0.0146529 0.0263565 0.0151817 -0.0946295 0.360233 0.4725781 -0.0189913 0.2869172 0.9374126 -0.0637292 -0.0577217 -0.0588996 -0.1026737 0.3621028 -0.4723129 0.0344318 -0.2936064 0.9381759 -0.0568009 -0.0274298 -0.0592785 -0.1023603 -0.5996519 -0.282902 0.0451408 -0.1948299 -0.3108188 0.0126428 0.0329629 0.0177029 -0.0125554 -0.6009361 0.2868875 0.0140011 0.1982743 -0.3095314 0.0209597 0.010251 0.0160309 -0.0124277 1.4285026 -0.0029289 -0.0618375 -0.0035104 0.3012856 -0.0232215 -0.059282 -0.0236578 -0.1241553 1.6408965 0.0559822 0.6219275 0.0658731 0.1933578 0.0867583 0.7106443 0.0842167 1.5024442 -0.0897085 0.0107509 0.1993471 0.0023195 0.004534 -0.0242999 0.0476465 -0.0227193 -0.3772322 0.0736247 0.0323305 0.0065525 0.0349684 0.0420371 0.0050524 0.0004532 0.004721 0.1564285 0.073548 -0.0315495 0.0101338 -0.0347337 0.0421486 0.007759 0.004227 0.0081007 0.1561598 -0.0090496 -0.0063368 -0.1159083 -0.0035485 0.126048 -0.0049845 -0.0549712 -0.0060741 0.0096863 0.0590782 -0.0788383 0.0175043 -0.0971244 0.0004172 0.0178616 0.0311403 -0.0258544 0.1020446 0.060491 0.0796767 0.0094435 0.0984724 0.0028449 -0.0059704 0.0204221 0.0369122 0.1010931 unknown
polarizability: 217.6761992|0.1585508|167.614197|-0.7334425|-3.5116014|98.1118628 unknown
InChI: InChI=1S/C8H5Br3N2O2/c1-4(14)13(12-15)8-6(10)2-5(9)3-7(8)11/h2-3H,1H3
charge 0 multiplicity 1
20 atoms
Br 0.244109 2.908607 -0.226888
Br 0.248178 -2.916685 0.100714
Br -4.742446 0.005226 0.161882
O  3.622382 0.079557 0.766558
O  1.269545 -0.169534 -2.442188
N  1.461168 -0.00851 -0.16781
N  2.095389 -0.100392 -1.500347
C  0.035616 -0.002912 -0.038747
C  -0.703134 1.211184 -0.083875
C  -0.701445 -1.215396 0.050967
C  -2.110003 1.231529 -0.021437
C  -2.108426 -1.230605 0.114813
C  -2.793462 0.001694 0.077635
C  2.389178 0.072821 0.949635
C  1.724531 0.144593 2.31378
H  -2.654888 2.177205 -0.054194
H  -2.651985 -2.174836 0.18721
H  2.515093 0.183581 3.077171
H  1.086137 -0.73851 2.494355
H  1.091063 1.045381 2.401366
