program: Gaussian 09
title: 000265005
version: EM64L-G09RevD.01
frameworkgroup: C1[X(C17H22NO3P)]
method: RPBEPBE
basis: SDD
operation: Freq
keyword: #p
keyword: freq=noraman
keyword: PBEPBE/SDD
title: #p freq=noraman PBEPBE/SDD
converged: YES YES NO NO
title: Mulliken charges:
elementType: P O O O N C C C C C C C C C C C C C C C C C H H H H H H H H H H H H H H H H H H H H H H
charge: 1.409845 -0.526924 -0.503835 -0.632527 -0.810776 -0.301652 0.473479 0.377825 -0.413202 -0.363304 -0.379563 -0.401754 -0.230622 -0.239200 -0.236353 -0.230597 -0.246875 -0.258532 -0.242909 -0.247096 -0.654157 -0.636532 0.267069 0.360684 0.258549 0.246578 0.256669 0.264305 0.227329 0.226236 0.225821 0.226109 0.224928 0.231465 0.240691 0.216648 0.228829 0.227763 0.248827 0.233758 0.209021 0.224445 0.238972 0.210564
chargesum: 0.00000
title: Mulliken charges with hydrogens summed into heavy atoms:
elementType: P O O O N C C C C C C C C C C C C C C C C C
charge: 1.409845 -0.526924 -0.503835 -0.632527 -0.450091 -0.034583 0.473479 0.377825 -0.154653 -0.116726 -0.122894 -0.137449 -0.003294 -0.012964 -0.010532 -0.004488 0.209517 0.198808 -0.014080 -0.019333 0.037449 0.037448
polarizability: 2.38221008e+02 1.69372852e+00 2.53213582e+02 2.12450345e+00 1.51328814e+01 1.63246860e+02
1716.lowfreq: -23.6932 -13.0728 -7.5684 -1.7546 -0.0017 -0.0014 -0.0013 9.7946 17.7495
frequency: -22.2503 7.1458 17.4055 22.2130 36.9136 41.1848 54.7823 61.9130 71.9760 89.9350 120.8240 153.0314 158.5458 188.2658 214.1342 215.9571 226.7663 244.8610 258.6421 290.5872 303.3552 327.0463 353.0724 390.8196 402.4678 404.7692 406.1436 438.5938 462.0642 467.3102 487.6484 540.1970 591.4524 602.7216 615.8573 616.8455 651.1494 665.6595 705.9424 706.9705 744.8620 764.2081 793.9396 804.9577 828.1114 850.6381 853.8829 857.9983 863.4751 866.7369 886.1770 933.7260 937.3678 982.1718 984.7859 990.4461 991.3785 997.6184 998.6677 1014.8674 1019.4549 1026.4628 1027.5341 1036.2997 1071.7226 1083.0923 1091.0200 1093.4737 1096.9976 1140.8373 1145.6351 1171.1195 1172.7192 1182.9638 1189.6972 1191.0474 1212.2147 1255.0246 1264.2808 1275.0252 1289.2211 1316.4117 1336.1149 1346.9608 1355.4911 1378.5313 1384.6323 1389.6941 1395.2483 1404.5081 1434.3151 1442.3124 1458.8572 1461.6742 1464.2591 1468.7975 1476.7035 1479.8498 1482.5645 1484.0806 1589.9534 1594.7476 1611.1739 1613.4047 2982.2931 2986.3932 2986.9873 3006.4226 3013.4692 3071.5962 3077.2344 3082.1484 3086.5012 3104.4992 3107.7654 3118.4907 3118.7409 3122.9723 3124.9915 3135.1187 3138.2249 3146.2830 3148.4126 3162.1984 3162.8026 3553.1331
redmass: 3.0540 4.9529 3.4030 3.6880 2.6763 4.0400 4.2509 4.0501 4.0781 4.2945 3.4676 3.5158 5.5040 3.1712 1.9684 4.1931 4.4368 1.5040 1.4619 5.1475 4.7084 2.7001 3.7166 3.6438 3.1446 4.4229 2.9138 3.5848 2.3541 4.1334 2.5607 3.3189 6.7460 5.6204 6.3662 6.3388 5.4165 6.7287 1.8839 2.0312 1.7319 1.8779 1.1236 1.1207 3.8636 3.8210 3.1471 1.3141 1.2719 3.1475 3.3609 1.4612 1.5720 1.4473 1.5757 4.8118 4.0752 1.3293 1.3114 3.0373 3.2934 2.5225 2.1704 9.8281 2.3512 1.6188 2.1726 2.1981 2.3783 1.5703 1.5423 1.0545 1.0573 1.5184 1.5133 1.2560 2.4737 1.3853 1.1218 1.1117 1.3469 1.3086 1.2709 1.2176 1.2054 6.3227 7.0914 1.2461 1.2234 1.3219 2.1208 2.1821 1.0668 1.0410 1.0526 1.0740 1.0789 2.1498 2.2364 1.0583 6.0807 6.1967 5.9625 6.0474 1.0828 1.0362 1.0362 1.0595 1.0608 1.1044 1.1028 1.0980 1.0986 1.1035 1.1039 1.0853 1.0868 1.0870 1.0873 1.0915 1.0922 1.0960 1.0951 1.1013 1.1014 1.0762
irintensity: 0.1539 0.3191 0.3072 0.5064 0.5679 0.6224 1.1493 0.6303 1.5427 2.0274 1.4471 10.8628 1.2760 10.2513 1.7932 0.9767 2.4046 1.0178 5.8993 3.2048 9.1690 1.5842 1.7388 33.3648 7.6793 13.1783 0.4858 7.0975 57.8550 25.1112 56.9474 27.3044 71.2077 12.4931 0.1173 1.1398 27.2871 168.4810 66.5393 31.4844 73.4101 31.1726 3.7528 4.1752 33.9857 2.2054 37.3374 9.1193 2.7574 123.5309 225.8244 11.2375 16.4256 0.5151 0.3832 1.3176 0.3902 2.0635 1.1341 130.3724 233.2901 21.1204 10.6440 93.9853 46.7843 5.3189 13.5537 27.0105 17.0103 4.6695 5.2164 0.3050 0.2007 14.2722 9.3962 2.2719 14.0074 12.7880 0.2131 0.2006 33.3983 6.6275 0.8607 12.1961 8.4578 3.0593 0.0864 17.8287 28.7075 38.7151 16.1842 12.4731 4.5512 12.0180 13.7437 2.4092 17.4766 15.1171 18.4067 13.5950 1.7212 0.1339 7.7654 4.5751 4.5054 17.3418 15.2107 36.8711 38.1098 2.1350 8.5778 50.0979 33.4383 33.7910 33.5759 5.3764 1.7166 0.4508 1.4895 10.9952 19.5566 33.2404 28.6829 33.6002 23.2344 33.7598
temp: 298.150 k
press: 1.00000 atm
elementType: 15 8 8 8 7 6 6 6 6 6 6 6 6 6 6 6 6 6 6 6 6 6 1 1 1 1 1 1 1 1 1 1 1 1 1 1 1 1 1 1 1 1 1 1
symmnumber: 1
zpe: 935503.6 jmol-1
zpe.correction: 0.356315 hartree
zpe.thermalcorrener: 0.378767 hartree
zpe.thermalcorrenthalpy: 0.379711 hartree
zpe.thermalcorrgfe: 0.300030 hartree
zpe.sumelectzpe: -1281.008119 hartree
zpe.sumelectthermal: -1280.985666 hartree
zpe.sumelectthermalent: -1280.984722 hartree
zpe.sumelectthermalfe: -1281.064403 hartree
dipole: 0.3529 -0.8308 -1.3856
dipole: 1.6537
quadrupole: -121.1577 -125.6550 -140.7589
quadrupole: -1.8771 -2.5128 -0.8097
quadrupole: 8.0328 3.5355 -11.5684 -1.8771 -2.5128 -0.8097
hfenergy: -1281.3644336 hartree
pointgroup: C01 [X(C17H22N1O3P1)]
dipole: 0.2970566 0.2578266 0.5182409 debye
polarizability: 241.1041485|6.7545307|252.3724213|4.9958596|4.3271946|161.2048797 unknown
InChI: InChI=1S/C17H22NO3P/c1-3-20-22(19,21-4-2)18-17(15-11-7-5-8-12-15)16-13-9-6-10-14-16/h5-14,17-18H,3-4H2,1-2H3
charge 0 multiplicity 1
44 atoms
P  1.874492 -1.125448 0.204716
O  1.926476 -2.289429 1.475451
O  3.341734 -0.252378 0.57994
O  1.810479 -1.544416 -1.335982
N  0.49198 -0.280307 0.754239
C  -0.500254 0.318038 -0.168363
C  -1.857127 -0.384347 0.020169
C  -0.568418 1.851421 -0.058139
C  -2.10332 -1.600056 -0.667175
C  -1.505346 2.564323 -0.852219
C  -2.836217 0.110078 0.91725
C  0.308844 2.580295 0.777839
C  -3.308087 -2.307464 -0.46482
C  -1.565428 3.973198 -0.805437
C  -4.039297 -0.601354 1.127277
C  0.244163 3.992709 0.833855
C  3.153737 -3.112803 1.672802
C  4.139289 0.31435 -0.548213
C  -4.280077 -1.810772 0.435905
C  -0.692024 4.695249 0.043211
C  3.289909 -4.198693 0.600176
C  3.660511 1.718692 -0.923671
H  -0.145856 0.065911 -1.189153
H  0.222273 -0.408435 1.732197
H  -1.340076 -1.992893 -1.350828
H  -2.192644 2.011469 -1.504206
H  -2.663382 1.057129 1.441741
H  1.048959 2.035186 1.37334
H  -3.489198 -3.242827 -1.006166
H  -2.292539 4.507846 -1.427211
H  -4.78879 -0.210723 1.825006
H  0.928424 4.54148 1.491283
H  3.001145 -3.546312 2.675038
H  4.032066 -2.44137 1.696029
H  4.081835 -0.374435 -1.411911
H  5.169418 0.32716 -0.152689
H  -5.215384 -2.35942 0.594566
H  -0.7406 5.789275 0.083667
H  3.423159 -3.756504 -0.402912
H  2.391322 -4.838548 0.576849
H  4.167578 -4.834857 0.821566
H  3.671724 2.386932 -0.04551
H  2.634678 1.69705 -1.331397
H  4.326171 2.147103 -1.696805
