program: Gaussian 09
title: 000264940
version: EM64L-G09RevD.01
frameworkgroup: C1[X(C20H18N2)]
method: RPBEPBE
basis: SDD
operation: Freq
keyword: #pfreq=noraman
keyword: PBEPBE/SDD
title: #p freq=noraman PBEPBE/SDD
converged: YES YES NO NO
title: Mulliken charges:
elementType: N N C C C C C C C C C C C C C C C C C C C C H H H H H H H H H H H H H H H H H H
charge: -0.008430 0.006163 -0.561056 -0.361041 0.548184 0.053855 -0.340464 -0.571608 0.022421 0.039479 0.050998 -0.369817 0.420433 0.418996 -0.345059 -0.574847 -0.573681 -0.694246 -0.408514 -0.407571 -0.237980 -0.238684 0.204069 0.215233 0.204542 0.211810 0.194470 0.198534 0.269265 0.238532 0.260681 0.268638 0.268355 0.218000 0.213216 0.210802 0.247167 0.247106 0.230976 0.231076
chargesum: 0.00000
title: Mulliken charges with hydrogens summed into heavy atoms:
elementType: N N C C C C C C C C C C C C C C C C C C C C
charge: -0.008430 0.006163 -0.141754 0.055311 0.548184 0.053855 0.052539 -0.302343 0.022421 0.039479 0.050998 -0.131285 0.420433 0.418996 -0.084378 -0.306209 -0.305326 -0.052229 -0.161348 -0.160465 -0.007005 -0.007608
polarizability: 5.28512601e+02 -2.99711921e+01 2.15821911e+02 2.81609455e+01 1.37500813e+01 1.15254733e+02
1716.lowfreq: -7.2169 -5.1488 -0.0008 -0.0004 0.0005 7.0287 17.6776 36.1676 61.4832
frequency: 16.6583 36.0755 61.4686 63.7317 87.2975 108.9948 138.7072 148.6873 179.7419 212.9617 222.5954 232.6903 266.5365 290.6322 326.5481 350.6668 357.6795 383.6428 426.7040 471.3884 472.2359 482.3660 491.0632 498.3839 537.0398 547.3915 589.1203 607.5615 620.3330 636.1328 718.9826 731.6675 733.0784 744.5157 751.9067 757.7073 778.9074 786.1091 802.1908 806.4165 837.7229 860.0999 860.9503 891.8783 902.9082 903.3026 912.1623 924.0413 925.8228 951.1851 972.5194 981.5161 992.3691 1009.5742 1010.7790 1071.2075 1082.6032 1104.7645 1117.9981 1140.3168 1161.1453 1168.7626 1173.0273 1196.6107 1205.1421 1220.9436 1240.9608 1256.4081 1264.3516 1272.1964 1279.0821 1288.5144 1301.2262 1314.8192 1322.4738 1349.5500 1366.7625 1367.6173 1387.8094 1402.7490 1421.5100 1442.9078 1453.0201 1465.2626 1469.6900 1471.5767 1475.6564 1479.8453 1488.4139 1493.1053 1497.9091 1529.9442 1551.9506 1588.4030 1627.2114 1645.3419 2963.9854 2968.2191 2974.2668 2977.1745 3004.1416 3024.5862 3048.3450 3071.5542 3073.9906 3124.2738 3124.6799 3130.3916 3145.8976 3146.0462 3147.6774 3149.6841 3162.6671 3164.5545
redmass: 3.8584 4.5837 1.5932 5.0516 3.7447 2.5644 5.1002 3.6340 4.6215 3.1911 1.2176 4.6133 3.5505 4.6048 4.7829 3.9512 4.5343 3.6961 3.6258 5.6570 2.8180 2.8972 5.1799 4.8760 4.7520 4.5327 6.6063 8.0234 6.9451 3.9794 6.6902 3.3947 1.2364 4.2697 4.9232 1.2853 2.6159 1.4406 2.3740 2.9099 1.7808 1.5163 3.6891 1.7356 3.3815 1.5701 1.5215 1.6949 1.9761 2.4957 1.3957 1.3341 1.3494 2.4043 3.7671 2.6018 1.4172 2.1571 2.2204 1.3950 1.6686 1.5547 1.2713 1.5687 1.5159 2.1068 2.0226 1.3538 1.8969 1.9112 1.9047 1.0762 4.0138 1.9143 1.4753 1.5525 2.0722 2.8411 1.2115 4.3101 4.4360 4.8179 3.7838 1.1248 1.1507 2.9991 1.0429 1.0774 1.1152 4.9746 5.5069 7.3254 7.0595 6.0706 6.3401 7.1886 1.0585 1.0604 1.0371 1.0602 1.0981 1.1007 1.1037 1.1006 1.0995 1.0885 1.0854 1.0887 1.0935 1.0924 1.0940 1.0920 1.0964 1.1005
irintensity: 0.1246 0.5555 0.0380 0.9026 0.0277 0.3363 0.0457 2.0593 0.0815 0.1486 0.1361 0.0736 0.4566 0.0643 0.8231 0.9069 0.8907 2.4099 1.8666 1.6221 14.0956 0.4872 14.5265 0.1533 2.7853 2.5627 2.9019 2.1574 0.1799 13.2423 1.8302 15.1842 5.6369 1.9973 2.0984 52.2329 0.0329 0.2111 6.0002 2.7011 43.3599 0.6149 11.9112 3.3669 11.3872 63.2632 2.7243 3.7199 0.5756 7.9234 9.6672 0.5602 0.0000 1.0039 7.9627 8.7086 10.3008 34.6692 0.6849 15.5175 1.5794 5.0518 0.1860 3.9188 0.7396 0.2415 0.8078 5.1349 0.2291 5.7886 0.7174 1.3912 1.1309 4.8149 1.2815 0.9709 12.0492 21.1652 11.6934 8.8532 22.8785 3.6027 0.8306 0.6645 6.3001 33.8185 13.2451 4.7070 18.3129 1.4983 2.2591 4.0169 12.8264 21.4186 19.2915 15.1454 14.6270 2.7762 40.4224 97.4493 3.7182 4.9426 35.2005 79.3460 61.1328 14.4512 0.9840 0.0896 5.5410 9.2696 32.5074 1.7627 22.1628 50.0848
temp: 298.150 k
press: 1.00000 atm
elementType: 7 7 6 6 6 6 6 6 6 6 6 6 6 6 6 6 6 6 6 6 6 6 1 1 1 1 1 1 1 1 1 1 1 1 1 1 1 1 1 1
symmnumber: 1
zpe: 849194.7 jmol-1
zpe.correction: 0.323441 hartree
zpe.thermalcorrener: 0.341520 hartree
zpe.thermalcorrenthalpy: 0.342464 hartree
zpe.thermalcorrgfe: 0.275993 hartree
zpe.sumelectzpe: -880.926786 hartree
zpe.sumelectthermal: -880.908707 hartree
zpe.sumelectthermalent: -880.907763 hartree
zpe.sumelectthermalfe: -880.974234 hartree
dipole: -0.7104 -0.1853 0.1141
dipole: 0.7430
quadrupole: -95.2059 -123.5399 -134.8208
quadrupole: -3.2272 3.4900 1.3666
quadrupole: 22.6496 -5.6844 -16.9653 -3.2272 3.4900 1.3666
hfenergy: -881.2502268 hartree
pointgroup: C01 [X(C20H18N2)]
dipole: -0.2776223 0.084232 -0.0356471 debye
polarizability: 530.0991819|28.0788854|207.5945513|-17.5976616|29.9475641|121.8955119 unknown
InChI: InChI=1S/C20H18N2/c1-2-3-6-14-9-10-17-18(11-14)22-20-13-16-8-5-4-7-15(16)12-19(20)21-17/h4-5,7-13H,2-3,6H2,1H3
charge 0 multiplicity 1
40 atoms
N  0.061564 1.019951 0.633287
N  0.426603 -1.692206 -0.361691
C  -4.842355 0.278833 0.867007
C  -5.642732 0.580699 -0.432017
C  -3.429148 -0.198836 0.584392
C  -0.993272 0.173628 0.449879
C  -7.094849 1.025855 -0.146853
C  -2.322929 0.628199 0.758936
C  -0.805156 -1.196872 -0.053672
C  1.314628 0.529177 0.322281
C  1.500319 -0.842111 -0.180278
C  -3.227562 -1.547832 0.086505
C  3.747936 0.903342 0.183881
C  3.932179 -0.464061 -0.316078
C  -1.965901 -2.033732 -0.220039
C  2.449315 1.364607 0.489925
C  2.807841 -1.300402 -0.485337
C  -7.886643 1.334104 -1.43576
C  4.912067 1.741856 0.348566
C  5.269284 -0.91516 -0.622529
C  6.181399 1.268584 0.041318
C  6.362346 -0.075651 -0.449762
H  -5.392076 -0.491971 1.445071
H  -4.816939 1.192127 1.491383
H  -5.654677 -0.320806 -1.077887
H  -5.115717 1.368395 -1.006499
H  -7.613891 0.232071 0.428597
H  -7.080761 1.923597 0.504314
H  -2.428095 1.65122 1.135708
H  -4.104873 -2.194661 -0.037528
H  -1.806642 -3.051857 -0.588568
H  2.286443 2.380699 0.864601
H  2.918283 -2.324564 -0.857255
H  -8.921695 1.648416 -1.208426
H  -7.405165 2.146421 -2.01177
H  -7.93958 0.444491 -2.091337
H  4.774133 2.763209 0.721979
H  5.405343 -1.936896 -0.995632
H  7.056793 1.914386 0.170176
H  7.372081 -0.428748 -0.685687
