program: Gaussian 09
title: 000264932
version: EM64L-G09RevD.01
frameworkgroup: C1[X(C14H16Cl2N2S)]
method: RPBEPBE
basis: SDD
operation: Freq
keyword: #p
keyword: freq=noraman
keyword: PBEPBE/SDD
title: #p freq=noraman PBEPBE/SDD
converged: YES YES NO NO
title: Mulliken charges:
elementType: Cl Cl S N N C C C C C C C C C C C C C C H H H H H H H H H H H H H H H H
charge: -0.058041 -0.057177 0.238560 -0.182562 -0.036987 0.453259 -0.369125 -0.370171 -0.377225 -0.369644 0.375559 -0.589111 -0.589074 -0.397031 -0.420947 0.284667 -0.714667 -0.148674 -0.726826 0.248340 0.239490 0.239775 0.250674 0.232152 0.232384 0.263348 0.295748 0.295934 0.262289 0.215780 0.273591 0.263863 0.242196 0.257347 0.242304
chargesum: 0.00000
title: Mulliken charges with hydrogens summed into heavy atoms:
elementType: Cl Cl S N N C C C C C C C C C C C C C C
charge: -0.058041 -0.057177 0.238560 -0.182562 -0.036987 0.453259 0.118705 0.120278 -0.145072 -0.137260 0.375559 -0.030014 -0.030851 -0.181250 -0.147356 0.284667 -0.450804 -0.148674 0.015021
polarizability: 3.52905736e+02 -4.96735171e+00 2.23672036e+02 -1.34937996e+01 9.87095995e-02 1.02760565e+02
1716.lowfreq: -1.4896 -0.0012 0.0009 0.0017 3.6726 7.8527 17.5105 29.4089 32.3655
frequency: 17.4542 29.4020 32.3025 38.4355 49.0044 62.6220 74.1984 90.6316 114.9032 121.4770 173.5178 196.6497 204.4384 231.1388 241.6826 257.0580 265.0130 312.7016 324.0819 389.1833 414.1949 425.1622 443.0421 493.8642 523.9368 528.8250 549.2810 572.1961 589.1599 637.5748 675.9876 678.2817 681.6462 729.8791 748.5815 768.1396 777.8471 790.3868 801.9932 812.9227 835.6226 874.3056 944.8913 950.8134 964.1123 980.6735 996.9576 999.6393 1031.0919 1036.4953 1042.5628 1044.1180 1062.8806 1119.5874 1136.3645 1141.3689 1180.0141 1201.9700 1213.4881 1223.4610 1252.0058 1258.7349 1280.5791 1284.5749 1296.7252 1329.6526 1347.1550 1350.2177 1370.6902 1388.6040 1394.3062 1434.9259 1454.2707 1457.5042 1457.7818 1461.9647 1479.6559 1480.7531 1495.4023 1536.4463 1553.6097 1567.4276 1630.9418 2990.8766 3007.7646 3012.2523 3059.9712 3063.8480 3068.2865 3071.7507 3074.2774 3114.4032 3130.8890 3144.6977 3147.0244 3149.1608 3160.6835 3169.5027 3239.2600
redmass: 5.1675 8.6790 9.2824 13.7257 3.4506 1.1076 4.5110 4.7244 2.9457 2.8451 6.2401 8.4814 4.1648 3.4253 3.4028 3.9105 5.8803 4.2565 5.6388 6.5457 3.3172 4.5419 2.9627 4.4134 4.1338 2.8151 6.7756 4.7278 4.6889 7.0983 6.0748 4.0085 5.5459 2.1310 3.9555 2.0432 1.1216 1.2546 5.2540 1.3327 1.6524 7.7307 1.6312 2.2126 2.5575 1.3508 1.4660 2.7680 4.1752 1.4086 1.8136 2.8083 1.7478 1.5238 1.4969 3.0576 1.5979 1.4782 1.2371 2.0550 1.1548 1.1621 1.3714 3.3253 1.2229 1.5358 1.5580 1.2591 5.1223 1.5997 1.2368 3.3918 1.1134 1.0769 1.0676 1.0959 1.4442 2.0323 1.0929 4.5665 6.1963 6.9162 6.3364 1.0368 1.0614 1.0612 1.0577 1.0567 1.1018 1.0981 1.1021 1.0990 1.0877 1.1056 1.0935 1.1116 1.0940 1.0958 1.0951
irintensity: 0.0264 0.1022 0.3050 0.9838 0.3147 1.1789 2.1306 1.7588 1.2297 0.5950 0.7510 5.7230 2.5121 6.9090 0.3151 2.2337 4.8093 3.3835 6.0347 12.1965 0.6318 1.9477 4.8692 0.2074 14.2619 7.8703 10.2331 22.7657 3.1354 3.9487 80.7920 16.5070 83.9734 11.9648 1.9901 64.4294 4.4739 8.3333 23.1591 13.4373 48.0327 3.8093 8.0975 24.0266 14.6702 1.4069 4.0932 1.0706 0.0875 2.4998 2.2516 0.9041 8.6555 36.0237 20.5413 32.8232 69.1828 0.6661 51.7744 27.7545 15.7824 14.8907 59.7457 28.2710 8.3112 11.4289 119.9743 3.0309 6.4774 40.1770 12.1820 14.4641 4.9038 22.8097 21.6103 27.4239 97.1413 148.7890 43.8656 16.8096 124.0024 28.4058 190.9235 19.2565 20.9591 40.9157 12.3138 24.3228 7.0678 13.0583 16.7566 5.2691 16.8446 11.3151 15.8834 19.0109 23.1522 7.6371 7.6532
temp: 298.150 k
press: 1.00000 atm
elementType: 17 17 16 7 7 6 6 6 6 6 6 6 6 6 6 6 6 6 6 1 1 1 1 1 1 1 1 1 1 1 1 1 1 1 1
symmnumber: 1
zpe: 711884.5 jmol-1
zpe.correction: 0.271142 hartree
zpe.thermalcorrener: 0.290835 hartree
zpe.thermalcorrenthalpy: 0.291779 hartree
zpe.thermalcorrgfe: 0.218492 hartree
zpe.sumelectzpe: -1969.368257 hartree
zpe.sumelectthermal: -1969.348564 hartree
zpe.sumelectthermalent: -1969.347620 hartree
zpe.sumelectthermalfe: -1969.420907 hartree
dipole: 1.0788 -0.2616 0.1799
dipole: 1.1245
quadrupole: -129.1024 -143.1392 -136.5597
quadrupole: 3.4330 -4.0953 -0.7634
quadrupole: 7.1647 -6.8721 -0.2926 3.4330 -4.0953 -0.7634
hfenergy: -1969.639399 hartree
pointgroup: C01 [X(C14H16Cl2N2S1)]
dipole: -0.4229854 0.1060749 0.0746783 debye
polarizability: 352.6692016|-7.5252197|223.638452|13.6955131|5.0729154|103.0306834 unknown
InChI: InChI=1S/C14H16Cl2N2S/c1-11-17-14(10-19-11)12-2-4-13(5-3-12)18(8-6-15)9-7-16/h2-5,10H,6-9H2,1H3
charge 0 multiplicity 1
35 atoms
Cl 4.923765 3.374578 -0.411457
Cl 4.419127 -3.686985 -0.620696
S  -5.455041 1.209476 -0.268931
N  2.786929 -0.053536 0.575004
N  -3.693276 -0.788671 -0.206238
C  1.385878 0.064312 0.406019
C  3.635275 1.143212 0.702096
C  3.432886 -1.375542 0.627318
C  0.745695 1.342682 0.37911
C  0.550953 -1.086447 0.264442
C  -1.477487 0.309629 0.107073
C  3.951821 1.772139 -0.669929
C  3.688741 -1.949285 -0.781083
C  -0.647419 1.45401 0.237895
C  -0.84136 -0.960254 0.123349
C  -2.941761 0.40276 -0.047613
C  -3.71252 1.562148 -0.0560
C  -4.986734 -0.583626 -0.334131
C  -6.037176 -1.638098 -0.518436
H  3.151708 1.896777 1.350219
H  4.581398 0.862417 1.196572
H  4.396312 -1.284822 1.158994
H  2.816014 -2.085058 1.20792
H  1.327768 2.264014 0.474085
H  0.978193 -2.093606 0.266183
H  4.595188 1.13119 -1.290599
H  3.043819 2.057288 -1.220262
H  2.763374 -2.064187 -1.363612
H  4.431648 -1.366834 -1.345957
H  -1.086963 2.457933 0.22661
H  -1.464885 -1.853329 0.018981
H  -3.389775 2.595173 0.049788
H  -6.585023 -1.502342 -1.468485
H  -5.550161 -2.626156 -0.5300
H  -6.779008 -1.618563 0.300371
