program: Gaussian 09
title: 000264911
version: EM64L-G09RevD.01
frameworkgroup: C1[X(C8H5Br2ClN2O2)]
method: RPBEPBE
basis: SDD
operation: Freq
keyword: #p
keyword: freq=noraman
keyword: PBEPBE/SDD
title: #p freq=noraman PBEPBE/SDD
converged: YES YES NO NO
title: Mulliken charges:
elementType: Br Br Cl O O N N C C C C C C C C H H H H H
charge: 0.081256 0.071825 0.014825 -0.171805 -0.173417 -0.276639 0.143393 0.615577 -0.316001 -0.227285 -0.163098 -0.180114 -0.225141 0.214417 -0.763616 0.282584 0.286481 0.269866 0.257324 0.259567
chargesum: 0.00000
title: Mulliken charges with hydrogens summed into heavy atoms:
elementType: Br Br Cl O O N N C C C C C C C C
charge: 0.081256 0.071825 0.014825 -0.171805 -0.173417 -0.276639 0.143393 0.615577 -0.316001 -0.227285 0.119486 0.106367 -0.225141 0.214417 0.023140
polarizability: 2.14207653e+02 2.34350341e-01 1.51293463e+02 3.42427311e-01 3.20413514e-01 9.67995998e+01
1716.lowfreq: -3.9816 -0.0023 -0.0023 -0.0022 4.6799 9.1169 25.6498 36.8925 55.8494
frequency: 25.6376 36.8887 55.8339 80.9951 95.8475 116.9335 126.8776 141.8431 146.4821 166.8423 185.6767 225.4954 250.4752 280.4630 336.7094 357.8011 367.5499 386.9632 462.8573 510.5398 532.8503 535.7395 574.2016 582.3831 627.7678 696.5978 729.8678 753.3673 828.4461 864.3212 875.7783 968.4627 997.5998 1036.1707 1068.9712 1097.2763 1171.9868 1186.5806 1266.6682 1337.6735 1362.5867 1380.8518 1405.8944 1437.3755 1444.3869 1462.3846 1535.2864 1562.9320 1659.0078 2997.6381 3086.3148 3134.2262 3185.5441 3188.3785
redmass: 14.4325 12.5715 4.8500 6.8532 11.9342 23.3649 1.0520 12.7860 7.7683 16.3283 4.6579 12.6358 24.0766 12.1652 11.2699 4.9513 7.4694 8.5285 9.0276 5.0731 4.1009 5.3194 4.5708 4.5379 6.5121 5.7007 10.3565 10.0199 7.3821 1.4416 1.3697 3.7636 2.8680 1.6814 3.3174 3.1569 3.2071 1.5853 4.5975 4.4069 4.9270 1.2280 3.6551 6.2011 1.1252 1.0474 9.4827 8.4142 9.8850 1.0371 1.0977 1.0998 1.0934 1.0940
irintensity: 0.0190 0.7499 5.3532 0.0553 0.5828 0.0237 0.0254 0.2115 0.4136 0.1626 0.0629 0.0602 0.3974 1.3216 0.1644 2.8673 27.8023 4.2065 10.0176 0.1276 2.4722 26.7229 0.6128 6.6368 101.8247 76.0367 77.3024 103.7041 90.0520 38.1365 0.1759 108.2447 12.9408 6.6496 34.5374 24.6066 202.2082 12.0484 95.4512 18.0166 40.0481 62.1711 144.4566 68.9111 46.5154 19.9886 82.2917 96.4640 237.3667 1.9684 3.9247 9.2535 1.4451 1.2340
temp: 298.150 k
press: 1.00000 atm
elementType: 35 35 17 8 8 7 7 6 6 6 6 6 6 6 6 1 1 1 1 1
symmnumber: 1
zpe: 304654.4 jmol-1
zpe.correction: 0.116037 hartree
zpe.thermalcorrener: 0.131829 hartree
zpe.thermalcorrenthalpy: 0.132774 hartree
zpe.thermalcorrgfe: 0.069370 hartree
zpe.sumelectzpe: -1053.619431 hartree
zpe.sumelectthermal: -1053.603638 hartree
zpe.sumelectthermalent: -1053.602694 hartree
zpe.sumelectthermalfe: -1053.666098 hartree
dipole: -4.3442 -0.4531 -3.2006
dipole: 5.4149
quadrupole: -129.3218 -105.9248 -113.8514
quadrupole: -4.0857 -5.8141 -1.4779
quadrupole: -12.9559 10.4412 2.5146 -4.0857 -5.8141 -1.4779
hfenergy: -1053.7354677 hartree
pointgroup: C01 [X(C8H5Br2Cl1N2O2)]
dipole: -1.7214062 -0.1605879 -1.2447636 debye
dipolederiv: -0.1377385 0.2542306 -0.0202467 0.2377183 -0.4737882 0.0461237 -0.0168238 0.0380273 0.0155823 -0.7584072 0.0178352 -0.0295832 0.0016384 -0.0422568 0.0043058 -0.0336267 0.004872 0.0088637 -0.2351715 -0.2621099 0.0228062 -0.2381217 -0.5858604 0.0436713 0.0222769 0.0440605 -0.0379164 -1.1756213 -0.0096368 0.2512166 0.0015268 -0.2672393 -0.0083869 0.052745 -0.0066359 -0.493077 0.0567126 0.0745251 0.7527912 -0.0049903 -0.1011154 -0.0626388 -0.0908673 -0.0826803 -1.0414746 -0.7961035 -0.0413338 -0.2249774 0.0051857 -0.1314914 -0.1039737 0.3770173 -0.0953988 -1.6202848 -0.1596494 -0.023278 -0.0622723 0.022784 -0.0128074 0.140443 0.3902963 0.1821232 1.9160686 0.3592629 0.0902666 0.0840891 0.0032993 -0.3515563 0.0252099 -0.0276485 0.0253571 -0.1063506 0.3694682 -0.4935672 0.0270424 -0.2842159 0.9165917 -0.0804353 0.0650979 -0.0794102 -0.1010959 0.4219579 0.3847932 -0.0513929 0.2455081 0.8989495 -0.0885394 0.021971 -0.0806315 -0.0292106 -0.6087324 0.2942572 -0.0503464 0.210572 -0.297122 0.0179931 -0.0354803 0.0237059 -0.0150294 -0.5880021 -0.2575439 -0.0058145 -0.1301326 -0.2612683 0.030052 -0.007307 0.0207823 -0.0290978 1.4229467 -0.0130742 0.0563709 -0.0217851 0.2873971 -0.0342379 0.0531097 -0.0346768 -0.1256735 1.660587 -0.0062006 -0.6242825 -0.0457447 0.1898558 0.0622548 -0.7242576 0.0374643 1.5059249 -0.0921417 -0.0071486 -0.1995899 0.0054892 0.0069515 -0.0103188 -0.0451209 -0.0146043 -0.3813695 0.072236 -0.0320274 -0.0056961 -0.0347013 0.0432127 0.0076626 0.0010883 0.0075418 0.1571731 0.0765262 0.0249078 -0.009337 0.0324093 0.0507477 0.0099997 -0.004948 0.0118513 0.162592 -0.0093955 0.005731 0.1161759 0.0058703 0.128224 -0.010614 0.055344 -0.0073077 0.01024 0.067236 0.0815687 -0.0185237 0.0927003 0.0017292 0.0174112 -0.034141 -0.0304617 0.1051775 0.0540296 -0.0821948 -0.0084297 -0.1050102 0.0008462 -0.0059824 -0.0187252 0.0360215 0.0989578 unknown
polarizability: 213.79526|-5.0557394|151.1955994|0.5791539|-5.2830014|97.3098559 unknown
InChI: InChI=1S/C8H5Br2ClN2O2/c1-4(14)13(12-15)8-6(10)2-5(9)3-7(8)11/h2-3H,1H3
charge 0 multiplicity 1
20 atoms
Br 0.247733 -2.912056 0.285906
Br -4.73887 -0.011258 -0.144965
Cl 0.193283 2.771445 -0.176808
O  3.627918 -0.040177 -0.767714
O  1.269139 0.181325 2.438759
N  1.465137 0.010821 0.165361
N  2.09682 0.120622 1.498027
C  0.040443 -0.007688 0.036066
C  -0.699228 -1.218612 0.112482
C  -0.699239 1.198267 -0.080471
C  -2.107006 -1.23656 0.056167
C  -2.103722 1.221889 -0.140522
C  -2.789843 -0.008373 -0.069477
C  2.394976 -0.04683 -0.951686
C  1.731073 -0.111115 -2.316409
H  -2.653393 -2.180224 0.113182
H  -2.640424 2.168436 -0.234418
H  2.521335 -0.171271 -3.078688
H  1.117195 0.788832 -2.500141
H  1.073973 -0.994673 -2.402252
