program: Gaussian 09
title: 000264905
version: EM64L-G09RevD.01
frameworkgroup: C1[X(C12H19N)]
method: RPBEPBE
basis: SDD
operation: Freq
keyword: #pfreq=noraman
keyword: PBEPBE/SDD
title: #p freq=noraman PBEPBE/SDD
converged: YES YES NO NO
title: Mulliken charges:
elementType: N C C C C C C C C C C C C H H H H H H H H H H H H H H H H H H H
charge: -0.299711 -0.384762 -0.337984 -0.365100 -0.351969 -0.480202 0.422936 -0.694562 -0.385960 -0.438326 -0.223795 -0.223071 -0.244252 0.178512 0.213287 0.185693 0.183343 0.208105 0.174554 0.193457 0.196385 0.247830 0.222490 0.192680 0.216190 0.209856 0.209161 0.272430 0.230798 0.223071 0.223129 0.225788
chargesum: 0.00000
title: Mulliken charges with hydrogens summed into heavy atoms:
elementType: N C C C C C C C C C C C C
charge: -0.051881 0.007038 0.031052 0.017558 0.037873 -0.065033 0.422936 -0.059355 -0.113530 -0.207528 -0.000724 0.000058 -0.018464
polarizability: 1.84621674e+02 -4.19947275e+00 1.29878747e+02 1.00109546e+01 4.42325061e+00 8.90232177e+01
1716.lowfreq: -12.7807 -5.8635 -0.0006 0.0004 0.0006 6.9563 21.1010 38.6456 44.0032
frequency: 21.0733 38.5745 43.9746 63.9997 97.9575 115.4644 129.9800 149.2204 212.8706 223.9341 229.0732 269.2136 367.5423 404.8316 408.3129 458.3080 510.3299 594.8256 616.5988 684.5808 707.3353 729.1695 747.3942 762.8334 808.4335 847.1237 858.3011 889.9500 913.6844 961.3061 971.5412 981.0852 989.5708 996.2988 1006.0720 1025.4940 1047.1381 1059.1178 1077.8067 1080.0015 1124.5340 1142.4126 1144.0343 1169.3847 1180.3857 1196.0498 1211.8151 1228.2893 1249.4460 1263.1557 1280.5727 1288.3734 1299.1838 1317.7817 1339.5320 1353.5592 1377.6459 1389.5826 1392.3099 1439.7251 1449.0749 1465.2938 1467.4828 1474.6088 1476.9691 1478.2099 1484.4263 1487.7613 1496.6658 1593.7275 1614.9495 2841.4708 2854.6585 2953.2625 2957.7895 2966.7646 2968.9938 2971.8775 2987.3423 2994.2342 3019.4210 3041.6902 3068.2962 3071.1313 3111.5289 3122.7912 3136.3731 3150.9847 3162.4654 3430.2671
redmass: 3.8318 1.9014 3.5291 2.7212 1.9880 2.8702 2.6614 2.1382 3.9001 3.6532 1.1424 3.0306 3.0014 2.9568 3.7477 2.8472 3.2308 4.7106 6.2820 1.3758 1.8541 1.0699 1.5495 1.1147 3.8299 1.1839 1.2487 1.8560 1.3390 1.2542 1.8150 1.3849 6.1050 1.3939 3.2442 2.1715 1.9656 2.8818 1.8520 1.8487 2.4607 2.5244 1.7908 1.0588 1.1127 1.5048 2.4047 1.3481 1.3148 1.2403 1.0655 1.1171 1.3283 1.3364 1.3979 1.6426 2.4490 1.2672 2.2928 2.1303 1.2167 1.0700 1.0728 1.2110 1.0560 1.1802 1.5384 1.1139 1.0934 6.1749 6.1353 1.0715 1.0714 1.0603 1.0631 1.0855 1.0593 1.0373 1.0835 1.0974 1.1012 1.1025 1.1008 1.0992 1.0869 1.0865 1.0923 1.0951 1.1008 1.0743
irintensity: 0.0462 0.0410 0.0674 0.7044 1.2692 0.3057 2.0846 2.1602 2.2559 0.8025 0.0072 0.5574 2.3610 0.0961 0.7302 8.4586 3.8753 2.9941 0.6853 75.8046 53.9575 11.3815 64.2777 0.9137 4.6739 1.2460 0.0749 6.0489 4.2615 6.7189 6.5745 0.2789 0.0042 1.6866 0.7761 12.8237 13.6322 0.0248 7.8003 2.4741 2.2410 59.0912 5.5612 0.3758 1.3597 2.4515 2.4282 6.6261 0.2544 1.1190 0.4637 0.2323 13.2899 1.2582 13.3282 0.2041 3.4787 13.7843 0.0819 9.6646 43.0932 1.4269 0.4840 25.4814 11.7828 2.3018 3.6753 12.6763 7.3182 0.6159 7.8609 73.3197 139.5077 2.4397 15.4952 26.6462 83.4412 33.4433 50.2623 1.7880 2.2228 80.2984 97.0418 53.4697 9.5142 0.7484 29.9140 29.1763 21.7952 0.5652
temp: 298.150 k
press: 1.00000 atm
elementType: 7 6 6 6 6 6 6 6 6 6 6 6 6 1 1 1 1 1 1 1 1 1 1 1 1 1 1 1 1 1 1 1
symmnumber: 1
zpe: 740420.3 jmol-1
zpe.correction: 0.282011 hartree
zpe.thermalcorrener: 0.296334 hartree
zpe.thermalcorrenthalpy: 0.297278 hartree
zpe.thermalcorrgfe: 0.238411 hartree
zpe.sumelectzpe: -522.405059 hartree
zpe.sumelectthermal: -522.390736 hartree
zpe.sumelectthermalent: -522.389792 hartree
zpe.sumelectthermalfe: -522.448659 hartree
dipole: 0.7518 -0.7310 -0.5499
dipole: 1.1840
quadrupole: -77.7299 -76.9648 -82.2122
quadrupole: 0.1003 1.6900 0.8982
quadrupole: 1.2391 2.0041 -3.2432 0.1003 1.6900 0.8982
hfenergy: -522.6870702 hartree
pointgroup: C01 [X(C12H19N1)]
dipole: -0.3062574 -0.3442636 -0.068427 debye
polarizability: 184.4960612|-6.5457628|111.7470242|9.6112834|20.5896325|107.2805538 unknown
InChI: InChI=1S/C12H19N/c1-2-3-7-10-13-11-12-8-5-4-6-9-12/h4-6,8-9,13H,2-3,7,10-11H2,1H3
charge 0 multiplicity 1
32 atoms
N  -0.342908 -0.152916 -0.146347
C  -2.778755 0.091503 0.308465
C  -4.213298 -0.00139 -0.257736
C  -1.696007 -0.2472 -0.734135
C  -5.300103 0.331828 0.78992
C  0.762434 -0.45429 -1.080661
C  2.130468 -0.230376 -0.444168
C  -6.73264 0.240234 0.221359
C  2.34391 0.851729 0.447861
C  3.217137 -1.086097 -0.753163
C  3.619669 1.076115 1.011307
C  4.496351 -0.860641 -0.194382
C  4.7021 0.222723 0.690539
H  -2.683786 -0.599978 1.173286
H  -2.588288 1.110859 0.697311
H  -4.315134 0.689965 -1.120392
H  -4.391017 -1.022994 -0.654828
H  -1.754634 0.47476 -1.57415
H  -1.910248 -1.258037 -1.16933
H  -5.197695 -0.358437 1.652155
H  -5.122156 1.352232 1.186356
H  -0.264717 -0.706239 0.718898
H  0.64409 0.225481 -1.950876
H  0.719122 -1.493177 -1.495725
H  -7.489965 0.48551 0.988559
H  -6.868778 0.941154 -0.623936
H  -6.947097 -0.779263 -0.151555
H  1.495142 1.499274 0.692347
H  3.061881 -1.933946 -1.432712
H  3.771328 1.916285 1.69908
H  5.326864 -1.531341 -0.443291
H  5.691832 0.397367 1.127743
