program: Gaussian 09
title: 000264916
version: EM64L-G09RevD.01
frameworkgroup: C1[X(C15H16O5)]
method: RPBEPBE
basis: SDD
operation: Freq
keyword: #pfreq=noraman
keyword: PBEPBE/SDD
title: #p freq=noraman PBEPBE/SDD
converged: YES YES NO NO
title: Mulliken charges:
elementType: O O O O O C C C C C C C C C C C C C C C H H H H H H H H H H H H H H H H
charge: -0.518372 -0.573512 -0.412057 -0.185600 -0.146527 0.250885 -0.022467 -0.603251 0.196809 -0.712545 -0.727176 0.033290 0.311125 -0.172677 0.290697 -0.193500 -0.380371 -0.375721 -0.223725 -0.233815 0.249928 0.270893 0.251457 0.208483 0.240629 0.240557 0.206207 0.239619 0.245894 0.355908 0.407633 0.292468 0.288718 0.236567 0.239050 0.424500
chargesum: 0.00000
title: Mulliken charges with hydrogens summed into heavy atoms:
elementType: O O O O O C C C C C C C C C C C C C C C
charge: -0.162464 -0.165879 0.012444 -0.185600 -0.146527 0.250885 0.227461 -0.080901 0.196809 -0.022877 -0.035456 0.033290 0.311125 -0.172677 0.290697 -0.193500 -0.087904 -0.087004 0.012842 0.005236
polarizability: 2.55509639e+02 -1.94040372e+01 2.07180615e+02 -9.98652869e+00 -1.14018820e+00 9.77889997e+01
1716.lowfreq: -6.8902 -5.9495 -0.0007 -0.0007 -0.0007 3.4983 26.6343 41.7689 56.9089
frequency: 26.5051 41.5850 56.9077 74.2638 93.7076 126.5775 151.3889 175.6747 190.4085 199.2085 216.2083 258.2777 266.0240 275.4204 280.4241 301.7043 332.7366 361.4735 368.8757 383.5603 402.6413 411.1223 421.4581 444.8829 451.9262 472.1772 496.8809 518.1645 547.7017 567.5527 598.4064 629.3827 657.5682 679.4598 693.7438 734.5016 762.9433 791.7574 797.4459 858.5106 871.3541 882.7790 924.4559 925.8960 932.2483 949.2425 976.7219 991.5813 994.5976 998.2126 1009.8278 1023.7552 1046.1194 1061.9312 1086.4992 1086.8497 1146.2394 1163.7478 1174.0122 1196.4651 1209.9964 1231.6802 1270.5639 1280.4651 1286.2121 1303.8870 1324.6401 1342.0592 1350.7260 1383.1413 1384.7671 1395.5571 1402.0199 1436.2723 1440.5186 1459.9537 1466.2684 1476.7549 1478.9368 1485.2183 1518.7382 1533.8721 1572.5155 1583.5726 1605.6121 1616.1618 2600.6489 2980.5541 2982.9489 2987.5394 2999.9960 3051.5710 3072.2101 3080.4069 3096.7303 3100.5802 3136.1174 3151.0488 3165.5143 3181.1644 3477.4473 3591.8697
redmass: 4.1740 5.2758 9.2468 5.1717 4.1917 4.7031 5.0391 4.0487 5.9127 1.1326 2.7921 1.1361 1.1107 3.2284 5.9080 3.9065 2.6140 8.0085 7.3152 6.5604 3.3353 3.8941 3.5952 4.8009 5.1014 5.4449 3.8251 4.2194 2.1461 4.7264 1.4560 6.6286 6.0504 4.6943 5.5049 3.4610 3.9772 1.5521 3.4387 3.2700 3.2920 3.9213 1.4758 1.9371 3.4393 2.5993 2.0431 1.4043 1.7109 1.3432 1.3621 2.4494 2.0394 2.0038 2.0419 1.7090 1.7095 2.1513 1.1459 2.5333 1.8693 2.1981 1.8260 1.3806 1.7362 2.5665 1.9989 1.4097 2.2717 1.3528 1.7136 8.8365 1.2227 2.1955 1.1313 1.0505 1.0610 1.0662 2.4629 1.0805 6.9619 2.5263 7.8260 3.6774 3.5673 6.1620 1.0783 1.0602 1.0396 1.0381 1.0825 1.0989 1.0980 1.0979 1.1000 1.0999 1.0863 1.0911 1.0974 1.0963 1.0645 1.0665
irintensity: 2.8914 1.3010 0.1965 7.0828 0.9328 1.4184 8.3716 1.9519 1.0433 1.3992 0.1594 53.3211 78.7335 5.1638 11.3692 1.4619 5.5508 1.5506 5.2684 10.9774 5.8581 0.4460 0.6585 3.7787 3.9015 8.5810 7.7216 35.0853 36.2900 10.7948 159.0006 0.9477 1.2440 21.0084 14.4241 15.7459 20.1025 49.3569 8.7198 17.2986 2.5402 14.3774 1.2919 3.1850 5.3018 14.9091 35.9968 1.2185 66.8507 51.5700 0.2452 12.4837 3.8903 129.3264 20.9159 26.7989 9.5728 18.0411 0.3438 5.9124 21.2949 90.1313 12.5337 10.0216 43.8271 134.1776 54.0728 36.2865 52.1977 62.0171 39.7081 6.0820 33.2608 13.4282 18.8839 2.4218 6.0997 19.0328 25.5002 30.9854 259.7560 22.0058 44.5507 123.6382 77.5751 10.5476 2017.2887 5.9679 21.5590 28.1445 41.4007 13.1672 10.9789 54.3024 15.8269 16.1070 4.1562 7.2744 19.0496 8.6775 102.4799 6.4180
temp: 298.150 k
press: 1.00000 atm
elementType: 8 8 8 8 8 6 6 6 6 6 6 6 6 6 6 6 6 6 6 6 1 1 1 1 1 1 1 1 1 1 1 1 1 1 1 1
symmnumber: 1
zpe: 736051.2 jmol-1
zpe.correction: 0.280347 hartree
zpe.thermalcorrener: 0.299001 hartree
zpe.thermalcorrenthalpy: 0.299946 hartree
zpe.thermalcorrgfe: 0.233627 hartree
zpe.sumelectzpe: -955.852563 hartree
zpe.sumelectthermal: -955.833909 hartree
zpe.sumelectthermalent: -955.832965 hartree
zpe.sumelectthermalfe: -955.899283 hartree
dipole: -4.7576 -5.1043 -0.1306
dipole: 6.9790
quadrupole: -75.8098 -134.8567 -118.5287
quadrupole: -10.0752 -0.8784 0.7967
quadrupole: 33.9219 -25.1250 -8.7970 -10.0752 -0.8784 0.7967
hfenergy: -956.1329101 hartree
pointgroup: C01 [X(C15H16O5)]
dipole: 1.7233125 -2.0349625 0.6543511 debye
polarizability: 257.6505565|11.310751|196.1840272|-16.7563655|-28.8468458|106.6446701 unknown
InChI: InChI=1S/C15H16O5/c1-15(2,20)11(16)7-10-12(17)8-5-3-4-6-9(8)13(18)14(10)19/h3-6,11,16-17,20H,7H2,1-2H3
charge 0 multiplicity 1
36 atoms
O  4.60572 -1.132102 1.262206
O  2.271716 -1.9080 0.556706
O  -0.208913 -2.099492 0.216705
O  0.37673 2.500631 -1.14513
O  -2.359546 2.920466 -0.733224
C  4.081616 -0.311902 0.117522
C  2.548129 -0.463504 0.336662
C  1.663832 -0.010458 -0.834618
C  0.186741 0.187828 -0.518808
C  4.523106 1.151669 0.289955
C  4.566381 -0.925147 -1.209698
C  -0.652589 -0.842363 -0.083786
C  -2.114236 -0.669436 0.076169
C  -0.353629 1.526517 -0.763019
C  -2.714302 0.602522 -0.157337
C  -1.873956 1.768816 -0.556571
C  -2.927893 -1.761435 0.462639
C  -4.111854 0.765223 -0.00252
C  -4.322402 -1.591845 0.607737
C  -4.918265 -0.328278 0.376154
H  2.283169 0.08529 1.263165
H  2.025986 0.96559 -1.204904
H  1.784416 -0.746286 -1.654225
H  5.617051 1.246833 0.157542
H  4.038519 1.809645 -0.452604
H  4.262051 1.516732 1.29838
H  5.672199 -0.929742 -1.251546
H  4.207969 -0.339398 -2.074132
H  4.204831 -1.962572 -1.313794
H  5.592585 -1.177006 1.218116
H  2.98383 -2.252278 1.1613
H  -2.453567 -2.729393 0.642729
H  -4.539094 1.756888 -0.184282
H  -4.944794 -2.44363 0.902679
H  -5.999612 -0.200489 0.492221
H  0.829276 -2.158096 0.334708
