program: Gaussian 09
title: 000264907
version: EM64L-G09RevD.01
frameworkgroup: C1[X(C9H8Br2N2O2)]
method: RPBEPBE
basis: SDD
operation: Freq
keyword: #p
keyword: freq=noraman
keyword: PBEPBE/SDD
title: #p freq=noraman PBEPBE/SDD
converged: YES YES NO NO
title: Mulliken charges:
elementType: Br Br O O N N C C C C C C C C C H H H H H H H H
charge: 0.055556 0.055399 -0.176947 -0.177299 -0.281180 0.142268 0.585354 0.471257 -0.309659 -0.311085 -0.374155 -0.366525 -0.795849 0.216834 -0.764402 0.261262 0.260923 0.233841 0.234223 0.252024 0.266784 0.260606 0.260769
chargesum: 0.00000
title: Mulliken charges with hydrogens summed into heavy atoms:
elementType: Br Br O O N N C C C C C C C C C
charge: 0.055556 0.055399 -0.176947 -0.177299 -0.281180 0.142268 0.585354 0.471257 -0.309659 -0.311085 -0.112893 -0.105602 -0.075761 0.216834 0.023757
polarizability: 1.71898978e+02 5.76494859e-02 1.84488251e+02 1.38940723e-01 -1.20573932e+00 1.03916812e+02
1716.lowfreq: -6.6275 -5.5289 -0.0008 -0.0006 -0.0003 5.2462 19.9623 29.5573 42.7574
frequency: 19.7451 29.4945 42.7549 57.9963 81.1209 95.3444 113.9775 147.1779 173.7454 177.1970 178.2976 197.5750 227.0416 251.4190 312.1995 360.0929 364.3535 379.5401 380.7351 511.5724 521.7613 533.0302 541.3206 582.2588 596.4079 666.0894 703.8639 713.9343 821.6530 860.0190 876.1297 896.5844 972.7516 1001.0262 1003.9127 1036.5301 1045.5369 1066.8639 1175.9923 1197.9871 1217.3470 1275.2544 1343.8191 1378.0721 1381.0613 1399.0353 1419.1392 1444.6092 1448.1143 1463.2149 1464.2359 1473.5430 1539.6349 1590.3147 1655.4907 2984.6485 2997.5621 3068.4358 3086.3750 3097.1779 3133.3134 3160.5678 3164.1124
redmass: 1.0129 14.5549 7.5748 5.3373 5.6463 7.3597 19.1857 1.0692 9.4349 4.3433 4.2669 4.1848 9.9845 14.1188 13.1318 5.6063 5.5057 6.3527 4.0111 5.2696 6.0962 3.8623 4.5085 4.2593 3.4849 6.5212 5.4324 9.7343 7.5048 1.4012 6.1907 1.3575 3.5935 2.8501 1.3941 1.6776 1.5606 3.1454 3.1646 1.6944 2.2391 7.2966 5.1482 3.2550 1.2282 1.2188 7.1052 1.3791 2.4595 1.0570 1.1232 1.0578 5.5642 7.1461 9.8098 1.0387 1.0369 1.0952 1.0977 1.1002 1.1001 1.0921 1.0933
irintensity: 0.4585 0.0010 0.3231 4.9288 0.2144 0.7323 0.0038 0.0070 0.3715 0.4835 1.6677 0.8617 0.2108 0.7515 1.8348 5.9744 5.1664 15.6654 1.9411 0.1264 0.4603 0.6589 26.6312 7.5313 18.2825 82.2826 86.6612 73.8797 127.2781 21.8875 7.0570 0.0147 100.8701 20.0637 5.0104 6.9799 23.8277 32.6772 199.1329 12.9221 5.7181 93.8257 4.3790 33.9209 62.4296 16.8485 88.8752 4.2760 71.0033 3.2604 65.5652 14.0054 60.5790 45.4979 228.3886 18.1941 1.7581 14.8147 3.6988 13.2191 9.8953 0.8815 3.0470
temp: 298.150 k
press: 1.00000 atm
elementType: 35 35 8 8 7 7 6 6 6 6 6 6 6 6 6 1 1 1 1 1 1 1 1
symmnumber: 1
zpe: 401347.8 jmol-1
zpe.correction: 0.152865 hartree
zpe.thermalcorrener: 0.169234 hartree
zpe.thermalcorrenthalpy: 0.170178 hartree
zpe.thermalcorrgfe: 0.105155 hartree
zpe.sumelectzpe: -633.464717 hartree
zpe.sumelectthermal: -633.448348 hartree
zpe.sumelectthermalent: -633.447404 hartree
zpe.sumelectthermalfe: -633.512427 hartree
dipole: 0.0062 6.7348 -3.4919
dipole: 7.5862
quadrupole: -101.4074 -105.6700 -108.8575
quadrupole: -0.1006 -0.0371 3.0365
quadrupole: 3.9042 -0.3583 -3.5459 -0.1006 -0.0371 3.0365
hfenergy: -633.6175821 hartree
pointgroup: C01[X(C9H8Br2N2O2)]
dipole: -2.6796329 -0.1441661 -1.3065133 debye
dipolederiv: -0.1316695 -0.2582297 0.0249816 -0.2161162 -0.5215596 0.0436126 0.0232683 0.0520757 -0.0044252 -0.1320745 0.2568941 -0.0305117 0.2163591 -0.5179742 0.0676059 -0.0221898 0.0584319 -0.0081389 -1.1537144 0.0310634 0.2425203 0.0092739 -0.2690674 -0.0251981 0.0327994 -0.023955 -0.4885567 -0.0040505 0.084519 0.7473062 -0.0052806 -0.1083677 -0.1076335 -0.054447 -0.106031 -1.0265648 -0.7054185 -0.0202956 -0.201101 0.0460658 -0.1428262 -0.1669074 0.3939247 -0.1676647 -1.5950882 -0.1294114 -0.0091706 -0.0813588 0.0333993 -0.0117352 0.2194759 0.2925566 0.2178518 1.8793258 0.2770726 0.0097346 0.082898 -0.0005263 -0.397293 0.0295317 -0.0054772 0.029944 -0.1030473 0.5099836 0.0022606 0.0030613 -0.0026375 0.2549763 -0.027525 -0.0729258 -0.0279188 -0.0090878 0.3127432 0.4502645 -0.0507282 0.3178911 0.9446041 -0.1076977 0.0132356 -0.1086926 -0.0862464 0.3110002 -0.4506066 0.0449734 -0.3082669 0.9421917 -0.1147913 0.0782388 -0.1118577 -0.0856363 -0.3656961 -0.2242687 0.0026456 -0.2880203 -0.2746342 0.0237269 0.0261897 0.0230711 -0.0931587 -0.3652876 0.2196225 -0.0441885 0.2859858 -0.2756299 0.0150596 -0.0351457 0.0153333 -0.0928115 -0.1992121 -0.0015718 0.0076344 0.0015227 0.0209597 0.0025675 0.1386861 0.0035559 0.0506619 1.6189049 -0.0759713 -0.6157027 -0.0828022 0.2031785 0.144949 -0.6598989 0.1432766 1.4699211 -0.0891292 -0.0215847 -0.199285 -0.0075057 -0.0000315 -0.044549 -0.0577482 -0.042276 -0.3760044 0.0468776 0.0607693 -0.0203506 0.0655475 0.0056975 0.017525 -0.0176474 0.0217111 0.1469391 0.04768 -0.0632105 -0.0070263 -0.0679434 0.0037343 0.0130338 -0.0035356 0.009012 0.1484358 0.0344383 0.0193248 -0.019756 0.0815076 -0.0375199 0.1052986 -0.0829613 0.0814982 0.0526777 0.0320926 -0.022026 -0.0170218 -0.0883197 -0.0616416 -0.0886703 -0.0712967 -0.0642522 0.0773546 -0.0217701 0.0027441 0.0425448 0.00697 0.1149168 -0.0107975 0.0780862 -0.0122861 -0.0646594 -0.0117428 0.0115867 0.1186062 0.0055935 0.1238385 -0.0100458 0.0583374 -0.0114668 0.0085071 0.0570373 0.0785271 -0.0232349 0.0929545 0.0016423 0.0257063 -0.0357343 -0.0179882 0.1007677 0.0613465 -0.0803748 -0.0069064 -0.0956519 0.0025407 -0.0042774 -0.0163151 0.0386275 0.0988347 unknown
polarizability: 184.5022015|-0.0654759|171.199536|-0.5872704|-6.860991|104.6023041 unknown
InChI: InChI=1S/C9H8Br2N2O2/c1-5-3-7(10)9(8(11)4-5)13(12-15)6(2)14/h3-4H,1-2H3
charge 0 multiplicity 1
23 atoms
Br 0.230241 2.9292 -0.262216
Br 0.230592 -2.875123 0.352841
O  3.623602 -0.072436 -0.723225
O  1.217843 0.301385 2.43581
N  1.448308 0.041315 0.177402
N  2.05953 0.193182 1.509621
C  0.023352 0.025101 0.024667
C  -2.842622 0.006831 -0.145677
C  -0.718601 1.225102 -0.140985
C  -0.718324 -1.183402 0.113144
C  -2.122105 1.224721 -0.232847
C  -2.121399 -1.202525 0.022851
C  -4.358189 -0.000873 -0.201749
C  2.391808 -0.085694 -0.920353
C  1.746427 -0.231477 -2.288259
H  -2.65797 2.168992 -0.36578
H  -2.657151 -2.153937 0.090009
H  -4.747154 0.853335 -0.781531
H  -4.741784 -0.930009 -0.656909
H  -4.785747 0.068459 0.816796
H  2.547938 -0.301508 -3.037926
H  1.102667 0.635571 -2.519814
H  1.121238 -1.140911 -2.336867
