program: Gaussian 09
title: 000264888
version: EM64L-G09RevD.01
frameworkgroup: C1[X(C7H12N4O3)]
method: RPBEPBE
basis: SDD
operation: Freq
keyword: #p
keyword: freq=noraman
keyword: PBEPBE/SDD
title: #p freq=noraman PBEPBE/SDD
converged: YES YES NO NO
title: Mulliken charges:
elementType: O O O N N N N C C C C C C C H H H H H H H H H H H H
charge: -0.445488 -0.209107 -0.208871 -0.321239 -0.142313 -0.157417 -0.003331 -0.362487 -0.342955 0.106711 0.053823 0.036279 -0.504571 -0.505145 0.252511 0.217443 0.344440 0.236691 0.202972 0.343632 0.231879 0.235636 0.234175 0.237318 0.235675 0.233741
chargesum: 0.00000
title: Mulliken charges with hydrogens summed into heavy atoms:
elementType: O O O N N N N C C C C C C C
charge: -0.101857 -0.209107 -0.208871 0.023201 -0.142313 -0.157417 -0.003331 0.107467 0.096707 0.106711 0.053823 0.036279 0.197119 0.201589
polarizability: 1.47806212e+02 5.73287775e+00 1.47759948e+02 -4.45100860e+00 5.18184385e-01 6.95179303e+01
1716.lowfreq: -8.5312 0.0005 0.0009 0.0010 5.8956 6.7193 34.9332 73.1279 78.4936
frequency: 34.7331 73.1191 78.4914 87.1299 126.0481 138.3247 142.4035 153.2249 179.9322 195.0490 210.2851 245.1730 256.5844 301.1478 347.8868 376.3836 435.2111 481.1696 524.1107 569.2138 621.4154 681.2949 695.6432 699.5196 711.0465 788.1388 840.5138 862.5487 888.2119 895.4411 969.0215 1008.1532 1033.2215 1043.9424 1078.2514 1112.4912 1113.5558 1136.4828 1150.6017 1162.4701 1175.1443 1215.0511 1251.1694 1292.9708 1322.9983 1335.2206 1360.8044 1376.6643 1384.5784 1432.0199 1448.1511 1451.2962 1451.5409 1460.2515 1461.2655 1463.1925 1471.7875 1479.2502 1500.1564 1581.8895 2945.5395 2990.2394 2999.7950 3002.3322 3066.0703 3098.7740 3100.7571 3104.0637 3142.6164 3144.4817 3539.0019 3562.1451
redmass: 4.6999 5.1572 3.1043 2.8733 1.4805 1.5014 2.4588 1.9568 3.4724 4.8789 5.1245 6.1012 3.9210 2.5347 1.0907 4.4204 4.2339 3.3569 9.8873 6.4647 4.0620 1.6067 5.0395 9.4938 2.9687 11.7367 2.3619 5.7823 10.9469 3.2434 7.6329 1.9652 3.8333 1.9526 5.5164 1.2531 1.2540 2.1136 1.6207 1.4937 1.4494 2.0446 2.6449 4.4160 1.2668 1.7579 2.4129 1.2052 1.8140 1.8948 1.4578 1.0613 1.0520 1.0933 1.0833 1.0580 1.5266 1.6660 3.5648 6.6316 1.0705 1.0668 1.0296 1.0294 1.0904 1.0994 1.1043 1.1044 1.1043 1.1047 1.0767 1.0663
irintensity: 1.5774 4.1445 9.0805 7.8508 0.0451 1.2271 3.8836 0.4825 2.4285 0.4043 0.6185 8.6085 8.0677 0.4108 192.4375 0.8514 29.2290 18.8781 2.2457 5.2180 13.0493 84.8220 0.8568 2.8107 35.7203 34.8411 10.2639 1.9750 1.5175 11.1382 9.4208 117.1440 40.5284 3.1274 113.4616 0.2816 0.0846 5.4170 63.1094 13.0847 29.6915 96.8870 29.2308 355.5371 33.8452 188.0123 110.7859 20.0361 203.1997 28.7328 115.7169 12.9190 17.6280 118.3326 13.1147 13.9974 287.2125 204.6978 451.8824 607.6836 61.4735 72.1050 50.1496 37.9408 10.5812 24.5938 32.8595 29.3842 25.2884 25.2182 105.0503 5.7930
temp: 298.150 k
press: 1.00000 atm
elementType: 8 8 8 7 7 7 7 6 6 6 6 6 6 6 1 1 1 1 1 1 1 1 1 1 1 1
symmnumber: 1
zpe: 532689.9 jmol-1
zpe.correction: 0.202891 hartree
zpe.thermalcorrener: 0.217620 hartree
zpe.thermalcorrenthalpy: 0.218564 hartree
zpe.thermalcorrgfe: 0.160274 hartree
zpe.sumelectzpe: -717.516078 hartree
zpe.sumelectthermal: -717.501349 hartree
zpe.sumelectthermalent: -717.500405 hartree
zpe.sumelectthermalfe: -717.558695 hartree
dipole: 6.1233 0.7637 -1.2080
dipole: 6.2878
quadrupole: -88.9445 -68.2224 -79.7744
quadrupole: 11.7815 -5.2847 1.9238
quadrupole: -9.9640 10.7580 -0.7940 11.7815 -5.2847 1.9238
hfenergy: -717.7189691 hartree
pointgroup: C01 [X(C7H12N4O3)]
dipole: -2.414063 0.2421708 0.483165 debye
dipolederiv: -0.7997101 -0.1754001 -0.095817 -0.2980562 -0.5979805 0.1972166 -0.119134 0.2249533 -0.2895033 -0.3958596 -0.2496296 0.0108893 -0.1272576 -1.7487995 0.0505785 0.0079645 0.0557094 -0.3279923 -0.7865848 0.7223082 0.0023458 0.5962696 -1.4255351 0.0010059 0.00605 -0.0100548 -0.326049 -1.7193708 -0.0858845 0.0573899 -0.2739699 -0.3155283 -0.0273204 -0.0871808 -0.0178427 -0.4660175 -1.6387947 0.2576516 0.0644426 0.3576689 -0.7417898 -0.0026666 0.083242 0.0019468 -0.2095223 -1.2688441 -0.3720423 0.0657844 -0.5888792 -1.0054923 0.0529833 0.0709285 0.0428218 -0.1966125 -0.6779759 0.2578783 0.0171489 0.219699 -1.6967822 0.0321622 0.0191567 0.0322082 -0.2152321 0.4140314 -0.1850283 -0.0899881 -0.4957683 0.1078529 0.0985537 -0.0834397 0.0366421 0.279051 0.5288126 0.1527396 -0.0292365 0.2252379 0.5259499 -0.1559032 0.0163775 -0.1624965 0.3164161 2.3054045 0.1309745 -0.1100785 0.3785524 0.9151036 -0.0321081 -0.135695 -0.03277 0.2112487 1.2415465 0.2647273 -0.0638464 0.1421644 2.2125148 -0.0698546 -0.0664593 -0.0792802 0.2188467 1.594212 -0.6708877 -0.055496 -0.4091269 1.9111898 -0.0267325 -0.0616969 -0.0097449 0.218136 0.2464658 -0.2739167 0.0114225 -0.0236362 0.7670862 -0.0142613 0.0049712 0.0012998 0.2718146 0.2156045 0.0314121 0.0010832 -0.237255 0.8201157 -0.0047569 0.0094235 -0.0179412 0.2718047 0.0985644 -0.0623227 0.0327475 0.0371711 -0.0175619 0.0560588 -0.0005498 0.0602008 0.0574721 -0.1131521 0.0359121 0.0525694 0.1389822 0.0574368 -0.0442143 0.1219707 -0.0824112 -0.1565452 0.2928074 0.0360858 0.0109335 0.1473009 0.1896383 0.0037721 0.0405391 0.0128791 0.3083087 0.1040504 -0.0165591 0.0549734 -0.0399867 0.0344311 -0.0477447 0.0240375 0.0006473 -0.1064387 -0.1724375 0.1004016 -0.005256 0.1011895 -0.1113498 0.0429185 0.0377196 -0.0012503 0.0779726 0.4139543 0.0423439 0.0776449 0.0902676 0.2350761 -0.1100982 0.1222376 -0.0584493 0.0687099 0.0046075 0.1265517 -0.1085347 -0.0026774 0.0253287 -0.0394307 -0.1030813 0.0004293 -0.0551096 0.026108 -0.1320759 0.0078432 -0.0768485 -0.1128861 0.0100072 0.0064301 0.012907 0.1232963 0.0256179 0.1291906 0.0910766 0.0059716 0.0288844 0.0346579 0.0929463 -0.0176808 -0.07331 0.0568249 -0.1136143 -0.1061592 0.0162942 -0.0209084 -0.006436 -0.0888333 -0.0423431 -0.04782 0.0789673 -0.1024204 0.0979639 0.0220799 -0.0202651 0.003285 0.0722252 0.054926 -0.0758985 -0.0748497 0.1516041 0.0081532 0.0946126 -0.0157295 -0.0016722 0.0098499 -0.0053055 0.1229736 unknown
polarizability: 148.0869689|-5.8437585|147.3489232|-4.7374575|-2.5298156|69.6481986 unknown
InChI: InChI=1S/C7H12N4O3/c1-13-6-9-5(8-3-4-12)10-7(11-6)14-2/h8,12H,3-4H2,1-2H3
charge 0 multiplicity 1
26 atoms
O  -4.433802 -1.415421 0.075504
O  1.782497 2.606552 -0.153582
O  2.744564 -1.889161 -0.069902
N  -1.733013 -0.515084 0.143632
N  0.476652 -1.268154 0.042172
N  -0.035633 1.116286 0.00042
N  2.282248 0.363777 -0.110791
C  -2.815589 0.468949 0.195704
C  -4.062541 -0.105153 -0.495778
C  -0.405339 -0.207835 0.060375
C  1.311884 1.316569 -0.086294
C  1.785832 -0.905596 -0.044238
C  0.780053 3.691915 -0.130363
C  2.270218 -3.288617 -0.00306
H  -2.476765 1.392377 -0.30475
H  -3.053982 0.735596 1.248647
H  -1.987462 -1.504385 0.206532
H  -3.850902 -0.320761 -1.555185
H  -4.90184 0.616523 -0.431754
H  -4.822172 -1.282087 0.977366
H  0.100451 3.612776 -0.995883
H  1.380699 4.611218 -0.18242
H  0.187425 3.655865 0.799356
H  1.607825 -3.515365 -0.855246
H  1.72161 -3.467923 0.936862
H  3.192382 -3.88546 -0.045526
