program: Gaussian 09
title: 000264927
version: EM64L-G09RevD.01
frameworkgroup: C1[X(C15H18N2O2S)]
method: RPBEPBE
basis: SDD
operation: Freq
keyword: #p
keyword: freq=noraman
keyword: PBEPBE/SDD
title: #p freq=noraman PBEPBE/SDD
converged: YES YES NO NO
title: Mulliken charges:
elementType: S O O N N C C C C C C C C C C C C C C C H H H H H H H H H H H H H H H H H H
charge: 0.149652 -0.305879 -0.292799 -0.413692 -0.464297 -0.100714 -0.377144 0.103948 -0.130992 0.102171 -0.721071 0.335295 -0.804680 0.429801 -0.429656 -0.319847 -0.839946 -0.196291 -0.223608 -0.248205 0.264434 0.231949 0.245394 0.318162 0.271564 0.261745 0.376636 0.236946 0.318673 0.246331 0.250749 0.248784 0.266548 0.256467 0.256658 0.232644 0.229801 0.234470
chargesum: 0.00000
title: Mulliken charges with hydrogens summed into heavy atoms:
elementType: S O O N N C C C C C C C C C C C C C C C
charge: 0.149652 -0.305879 -0.292799 -0.095530 -0.087661 0.163720 0.100199 0.103948 -0.130992 0.102171 -0.187761 0.335295 -0.002730 0.429801 -0.178907 -0.071063 -0.060274 0.036353 0.006193 -0.013735
polarizability: 3.46269826e+02 -1.58192274e+01 2.15482892e+02 1.04299049e+01 1.17241341e+01 1.14792654e+02
1716.lowfreq: -5.8815 -3.5832 -0.0010 0.0006 0.0010 3.3819 21.2628 24.0484 32.0131
frequency: 20.5339 23.9363 32.0067 37.1846 60.0805 81.7535 108.1706 112.5125 122.3166 148.4037 175.4415 200.8539 221.7774 229.3805 242.7390 265.2388 274.7647 301.6444 333.4411 384.8637 400.5374 409.3287 435.0530 445.0664 494.2757 507.5515 543.4519 557.3073 599.6241 611.2783 616.9939 626.7122 644.6354 666.8347 692.2715 704.7661 718.3601 762.9265 772.8017 802.8144 817.6584 835.6469 907.6435 922.1809 962.6918 967.4187 969.6164 978.1788 982.1336 988.2043 993.5409 995.7275 1025.1321 1041.5671 1047.7985 1072.0130 1080.7557 1092.7725 1109.0592 1159.5932 1175.0826 1182.6574 1194.7771 1210.7552 1234.7224 1253.8550 1269.4137 1281.6660 1325.1955 1332.2480 1336.8011 1346.3305 1372.5338 1380.4515 1402.3692 1412.0517 1437.9745 1439.4715 1447.1734 1452.8636 1455.8217 1470.5567 1481.3750 1487.3789 1514.5068 1567.5710 1588.9490 1612.0016 1636.7095 1676.0809 2959.5311 2981.0733 2987.9540 3000.4825 3003.8321 3010.5708 3051.1883 3065.2903 3079.7817 3102.7828 3118.7558 3129.6194 3131.6659 3137.0312 3150.2573 3168.8453 3197.7187 3587.0844
redmass: 5.0180 3.9063 3.6317 5.9191 4.2671 5.0781 4.6949 4.3557 5.1721 1.5296 2.9611 3.1064 5.8748 3.6218 4.5917 1.3137 2.1276 3.7696 3.2773 5.1244 3.8461 2.9613 4.1167 4.2447 1.1927 3.1535 3.4585 7.0918 4.3284 5.9146 6.5458 4.0919 4.5912 6.4971 2.1552 4.3684 3.3018 1.9972 3.2733 3.8298 3.2659 1.2655 1.4188 1.6789 2.3921 1.3349 1.3588 1.9244 1.8386 2.6898 1.3086 1.5717 2.3864 1.7647 1.7360 2.2909 2.3932 1.5786 2.8266 1.1491 1.0524 1.3028 1.1220 2.0774 3.2576 2.0952 3.0645 1.3349 1.4061 1.4317 1.3709 1.1833 1.9304 5.9318 1.3467 3.1963 2.2651 1.0857 1.0729 1.1909 1.0669 1.0591 2.2178 1.1544 4.2533 6.1735 5.8706 5.8395 7.1817 1.6724 1.0814 1.0380 1.0607 1.0857 1.0300 1.0587 1.1005 1.0949 1.1053 1.1016 1.1054 1.0866 1.1028 1.0885 1.0943 1.0999 1.0938 1.0789
irintensity: 0.1213 0.4397 1.1308 0.2794 0.9780 1.2241 4.7050 3.1286 1.2639 0.5432 2.2725 1.6186 1.5892 2.4499 2.9935 1.0855 3.4968 5.0621 7.6104 27.2936 1.6383 0.6878 1.9653 9.4642 119.0533 12.2583 1.2368 16.7284 5.2329 0.5086 0.5158 9.9917 3.3193 2.1642 30.0964 23.7108 2.6389 66.4872 15.7164 19.2476 24.8304 0.0472 1.1200 6.9711 2.9612 5.9369 10.6737 68.4599 27.6311 6.0679 12.6920 12.1626 6.6260 3.7996 5.2756 27.0689 14.9361 12.2623 5.0421 67.1000 0.1040 27.0080 6.0545 77.1919 27.6425 120.1671 20.8825 14.4534 5.2929 5.2330 15.1630 6.4988 22.7879 75.2400 137.6364 252.1742 75.7006 2.1418 20.3523 85.3543 21.7659 10.0593 165.6156 50.7670 66.3522 321.3351 184.2402 41.7146 318.4193 581.2678 18.6107 12.3625 9.6437 171.6054 24.5723 33.1613 15.8585 9.6101 16.7262 3.4951 19.3472 6.4621 10.7524 1.8892 20.8824 30.2506 5.1914 45.6701
temp: 298.150 k
press: 1.00000 atm
elementType: 16 8 8 7 7 6 6 6 6 6 6 6 6 6 6 6 6 6 6 6 1 1 1 1 1 1 1 1 1 1 1 1 1 1 1 1 1 1
symmnumber: 1
zpe: 796603.9 jmol-1
zpe.correction: 0.303410 hartree
zpe.thermalcorrener: 0.323343 hartree
zpe.thermalcorrenthalpy: 0.324287 hartree
zpe.thermalcorrgfe: 0.252119 hartree
zpe.sumelectzpe: -1238.970973 hartree
zpe.sumelectthermal: -1238.951041 hartree
zpe.sumelectthermalent: -1238.950096 hartree
zpe.sumelectthermalfe: -1239.022264 hartree
dipole: 2.1478 -2.7868 1.5151
dipole: 3.8308
quadrupole: -104.9153 -133.0046 -126.9718
quadrupole: 4.8235 -4.6852 4.5286
quadrupole: 16.7153 -11.3741 -5.3412 4.8235 -4.6852 4.5286
hfenergy: -1239.2743832 hartree
pointgroup: C01 [X(C15H18N2O2S1)]
dipole: -0.8900504 -1.0800382 -0.5592721 debye
polarizability: 347.0058425|9.5605334|212.4879371|14.9713625|-17.4592427|117.0515922 unknown
InChI: InChI=1S/C15H18N2O2S/c1-10(16-11-6-4-3-5-7-11)13-14(18)12(8-9-20-2)17-15(13)19/h3-7,12,16-17H,8-9H2,1-2H3
charge 0 multiplicity 1
38 atoms
S  5.786364 -1.071142 0.656382
O  0.704362 -1.39782 0.061086
O  1.262614 3.414523 0.170045
N  2.727208 1.559824 0.156651
N  -1.619071 -0.044518 -0.035505
C  2.707224 0.087309 0.161015
C  3.469551 -0.576106 -1.0100
C  1.200033 -0.206971 0.092214
C  0.478876 1.044767 0.058295
C  1.461973 2.16046 0.129983
C  4.998967 -0.414734 -0.937952
C  -0.932138 1.142667 -0.002279
C  -1.628922 2.479906 0.010631
C  -3.011566 -0.334329 -0.0879
C  -3.404782 -1.609877 0.407508
C  -3.997572 0.523732 -0.64595
C  5.40562 -2.906509 0.464142
C  -4.754377 -2.009246 0.364926
C  -5.348765 0.115752 -0.675111
C  -5.738804 -1.144949 -0.170074
H  3.12402 -0.310733 1.110883
H  3.112154 -0.139659 -1.963995
H  3.192786 -1.647289 -1.02039
H  3.567576 2.118076 0.302589
H  5.484479 -0.930066 -1.785469
H  5.300563 0.647659 -0.971092
H  -0.975598 -0.877161 0.019945
H  -1.951893 2.768789 -1.007701
H  -0.91676 3.249078 0.348383
H  -2.521493 2.462362 0.659799
H  -2.645055 -2.277721 0.830198
H  -3.722596 1.48507 -1.082293
H  4.325012 -3.098127 0.551672
H  5.938072 -3.417962 1.280936
H  5.784539 -3.269103 -0.505201
H  -5.037791 -2.993509 0.752885
H  -6.09808 0.786674 -1.109538
H  -6.789031 -1.452915 -0.200317
