program: Gaussian 09
title: 000264903
version: EM64L-G09RevD.01
frameworkgroup: C1[X(C18H20O2)]
method: RPBEPBE
basis: SDD
operation: Freq
keyword: #pfreq=noraman
keyword: PBEPBE/SDD
title: #p freq=noraman PBEPBE/SDD
converged: YES YES NO NO
title: Mulliken charges:
elementType: O O C C C C C C C C C C C C C C C C C C H H H H H H H H H H H H H H H H H H H H
charge: -0.434861 -0.266872 0.233128 0.376463 -0.224773 -0.562127 0.045264 -0.532463 0.126705 -0.475211 -0.466039 -0.795845 -0.688613 0.168669 0.332931 -0.412091 -0.588979 0.324508 -0.367267 -0.536002 0.213523 0.240630 0.207676 0.223319 0.230260 0.215090 0.245661 0.232095 0.212392 0.240972 0.229892 0.242016 0.241416 0.339899 0.241716 0.255481 0.247524 0.244385 0.219613 0.219918
chargesum: 0.00000
title: Mulliken charges with hydrogens summed into heavy atoms:
elementType: O O C C C C C C C C C C C C C C C C C C
charge: -0.094963 -0.266872 0.233128 0.376463 -0.011250 -0.113822 0.045264 -0.078885 0.126705 -0.014461 -0.233944 -0.112589 -0.205181 0.168669 0.332931 -0.170375 -0.333499 0.324508 -0.119744 0.147915
polarizability: 3.35979937e+02 -2.64299781e+01 2.05254918e+02 3.85988142e+00 -1.86134002e+00 1.19562005e+02
1716.lowfreq: -9.8076 -8.7044 -0.0008 -0.0007 -0.0006 5.3469 35.7112 68.2113 78.3187
frequency: 35.6493 68.2018 78.3179 109.6757 123.2018 148.0446 186.6278 200.5790 214.4807 227.8152 241.9243 250.9817 258.7200 269.9878 287.2990 318.9871 341.8668 351.0234 387.9034 414.6300 429.9125 449.1624 454.8485 472.7390 506.0550 506.7995 555.9351 593.5398 600.4251 624.5991 658.4712 696.0385 736.1607 741.9730 751.9982 774.3789 795.2993 825.7313 845.5889 852.0736 874.1817 901.1346 906.8570 918.0749 936.0255 939.0371 951.7653 956.5662 978.3100 993.3407 1001.2611 1015.9810 1030.5593 1078.1442 1097.6580 1111.1738 1112.8921 1118.7864 1142.0954 1150.1859 1153.7051 1156.3905 1173.4751 1197.3315 1199.7684 1203.0583 1223.1630 1229.7938 1253.6499 1281.1658 1286.9878 1292.9624 1314.8500 1323.7615 1348.6813 1366.4854 1384.5634 1391.2570 1406.3113 1421.1644 1426.7270 1448.1606 1451.4934 1456.1389 1463.2714 1465.4030 1471.0458 1472.5908 1479.3502 1488.9104 1566.6570 1591.3835 1617.1540 1649.1892 2955.4114 2955.6396 2957.1376 2968.3892 2971.2052 2977.7342 2980.2183 3005.5247 3024.3115 3037.8859 3039.4526 3041.6902 3062.6750 3079.0383 3121.6969 3132.0302 3147.9378 3148.7647 3166.8179 3560.6495
redmass: 4.5820 3.5044 3.9307 4.2296 4.0437 3.2249 3.7222 2.3616 1.5239 3.1988 1.3140 2.5246 1.8649 2.6571 2.1639 2.7897 1.3601 2.4836 2.6166 3.4844 2.7774 3.9365 4.2120 3.3961 3.4765 4.0168 4.1857 3.6974 3.8904 4.6999 3.3815 3.0323 4.1800 4.7595 3.6517 1.8391 2.4951 1.4469 1.9540 1.6151 2.5849 2.4068 3.7265 2.0440 2.1151 2.0014 1.4661 2.1486 2.7871 4.0427 1.8945 2.1228 2.3316 2.9877 1.9134 1.2629 2.0265 1.1501 1.4675 1.7758 1.2049 1.4907 1.3956 2.0949 1.8540 1.4676 2.8388 1.6054 1.6650 1.5233 1.7692 1.7978 1.9114 1.4990 2.1528 1.3625 1.3898 3.1728 4.7904 1.2228 1.4919 1.0948 1.9723 1.1929 1.0738 1.0507 1.3180 1.1435 1.8349 1.0616 6.8153 8.0058 7.0146 8.3741 1.0331 1.0631 1.0772 1.0510 1.0513 1.0699 1.0608 1.0950 1.0986 1.0954 1.1003 1.1037 1.0988 1.0988 1.0991 1.0892 1.0909 1.0950 1.0952 1.0658
irintensity: 0.9222 3.8508 0.4015 1.7057 2.3685 1.9085 1.2315 3.8375 0.9957 1.7014 1.8441 1.5988 2.8553 0.9266 7.5513 2.1008 148.1879 41.4739 22.4577 1.9753 5.8999 3.3326 15.2944 2.4579 3.1351 7.2022 6.4361 2.8477 2.6579 5.9262 5.6944 1.8496 0.7927 2.7734 1.5630 5.0415 23.7484 34.4196 2.0371 52.6781 7.8862 0.5814 15.8357 32.4311 4.8246 16.2452 1.4268 5.6416 5.8722 38.4264 19.4789 32.2914 13.6121 4.8829 6.5945 0.4947 46.7991 1.0584 14.1600 23.0427 10.9901 30.2153 11.2590 7.0215 1.7579 7.4738 133.2509 6.5747 73.1800 18.9203 16.1613 36.9510 7.4418 7.3331 15.2285 3.6786 16.9862 16.6261 35.5533 16.9426 30.4463 12.2158 12.9273 6.3103 9.8362 13.1028 100.0610 16.2030 2.1566 7.1312 4.7224 8.6867 95.5188 4.8585 77.3438 28.7878 15.3144 26.3177 42.4846 151.3796 13.0316 26.4493 6.9683 7.7864 39.3723 52.8978 31.3246 27.9374 31.0137 12.8832 12.5816 18.5393 13.2617 4.4132
temp: 298.150 k
press: 1.00000 atm
elementType: 8 8 6 6 6 6 6 6 6 6 6 6 6 6 6 6 6 6 6 6 1 1 1 1 1 1 1 1 1 1 1 1 1 1 1 1 1 1 1 1
symmnumber: 1
zpe: 870832.9 jmol-1
zpe.correction: 0.331683 hartree
zpe.thermalcorrener: 0.349423 hartree
zpe.thermalcorrenthalpy: 0.350367 hartree
zpe.thermalcorrgfe: 0.287269 hartree
zpe.sumelectzpe: -846.883763 hartree
zpe.sumelectthermal: -846.866023 hartree
zpe.sumelectthermalent: -846.865078 hartree
zpe.sumelectthermalfe: -846.928176 hartree
dipole: -0.2002 -0.5127 1.2552
dipole: 1.3706
quadrupole: -113.0307 -104.6745 -124.0833
quadrupole: 17.2856 5.6843 -2.8336
quadrupole: 0.8988 9.2550 -10.1538 17.2856 5.6843 -2.8336
hfenergy: -847.2154457 hartree
pointgroup: C01 [X(C18H20O2)]
dipole: 0.0733533 -0.2022624 -0.4944354 debye
polarizability: 337.1176405|23.4508058|204.1210328|3.5877985|1.9366996|119.5581866 unknown
InChI: InChI=1S/C18H20O2/c1-18-8-7-14-13-4-3-12(20-2)9-11(13)10-15(14)16(18)5-6-17(18)19/h3-5,9,17,19H,6-8,10H2,1-2H3
charge 0 multiplicity 1
40 atoms
O  -4.663248 0.103773 1.557509
O  5.465499 -0.156575 0.081627
C  -2.990503 0.429908 -0.349843
C  -2.052065 -0.773788 -0.145654
C  -4.378486 -0.136276 0.129821
C  -2.463543 1.650581 0.451612
C  -0.629843 -0.512756 -0.09361
C  -1.003167 2.011917 0.053473
C  -0.129255 0.780668 -0.018731
C  -4.261065 -1.679638 -0.022774
C  -2.763882 -1.936037 -0.024028
C  -3.096747 0.766536 -1.864885
C  0.513196 -1.522211 -0.090799
C  1.337399 0.73308 0.015731
C  1.750476 -0.634449 -0.028212
C  2.310133 1.760555 0.083637
C  3.108654 -0.990049 -0.007578
C  4.074049 0.052979 0.057291
C  3.675979 1.415277 0.102919
C  5.944013 -1.538372 0.035974
H  -5.202552 0.288942 -0.481446
H  -2.478133 1.397136 1.528892
H  -3.115289 2.535167 0.297212
H  -0.588499 2.729816 0.789032
H  -0.990294 2.54213 -0.9220
H  -4.75164 -2.03629 -0.951886
H  -4.778925 -2.167414 0.824001
H  -2.33369 -2.93649 0.092616
H  -3.746145 1.648622 -2.026842
H  -2.105126 0.983561 -2.298634
H  -3.522624 -0.084112 -2.428002
H  0.503384 -2.160522 -0.996501
H  0.453715 -2.207318 0.778592
H  -4.732905 1.080073 1.71107
H  2.01561 2.815403 0.118825
H  3.40937 -2.041992 -0.039827
H  4.458388 2.178651 0.15296
H  7.041238 -1.464429 0.063215
H  5.628282 -2.045188 -0.89721
H  5.588547 -2.118862 0.910055
