program: Gaussian 09
title: 000264926
version: EM64L-G09RevD.01
frameworkgroup: C1[X(C16H20N2O2)]
method: RPBEPBE
basis: SDD
operation: Freq
keyword: #p
keyword: freq=noraman
keyword: PBEPBE/SDD
title: #p freq=noraman PBEPBE/SDD
converged: YES YES NO NO
title: Mulliken charges:
elementType: O O N N C C C C C C C C C C C C C C C C H H H H H H H H H H H H H H H H H H H H
charge: -0.208440 -0.296851 -0.409076 -0.453749 -0.149820 -0.414239 -0.032538 0.050617 -0.063956 0.085871 -0.709325 -0.719874 0.286365 -0.823566 0.504563 -0.443599 -0.314721 -0.197504 -0.219409 -0.249598 0.248222 0.211603 0.234656 0.203983 0.330807 0.207851 0.225370 0.213171 0.203982 0.219531 0.218027 0.306639 0.249025 0.326351 0.207113 0.230087 0.259629 0.227392 0.226181 0.229230
chargesum: 0.00000
title: Mulliken charges with hydrogens summed into heavy atoms:
elementType: O O N N C C C C C C C C C C C C C C C C
charge: -0.208440 -0.296851 -0.078269 -0.147110 0.098402 0.032019 0.171445 0.050617 -0.063956 0.085871 -0.062933 -0.078334 0.286365 -0.041078 0.504563 -0.213513 -0.055092 0.029887 0.006773 -0.020368
polarizability: 2.58075215e+02 1.79393715e+01 2.22576173e+02 1.43023089e+01 -3.76820377e+00 1.33403087e+02
1716.lowfreq: -7.7545 -2.6109 -0.0006 -0.0005 0.0008 6.9759 24.5019 30.1941 34.5172
frequency: 23.4650 30.1530 34.4686 50.9024 68.5071 94.2430 112.1554 131.9772 137.8880 156.1757 163.5631 203.7714 219.9248 230.5818 257.8605 266.0098 291.6307 320.0162 338.5224 363.9173 384.8671 404.2646 411.8985 457.6912 483.5334 502.2972 530.3529 542.7456 563.6201 610.0790 613.7119 632.0040 645.0870 652.4097 667.6731 690.2722 726.1366 756.5658 761.8985 810.4199 826.6047 838.5736 862.3799 906.6332 911.8077 935.8550 955.0074 964.1484 966.0722 986.8578 989.1766 1006.4971 1024.0081 1037.9180 1042.9386 1052.2757 1079.7121 1098.3566 1120.3394 1133.1795 1172.4657 1176.5456 1187.2314 1193.5985 1197.5948 1230.8311 1232.5310 1259.8423 1301.0401 1315.4769 1322.1194 1343.2033 1349.9936 1357.4658 1365.9627 1374.7527 1393.8487 1394.3388 1402.4437 1435.1581 1443.3614 1452.3305 1465.4786 1479.3006 1482.9419 1484.1346 1485.6167 1493.7387 1519.5164 1577.8171 1599.4091 1608.7364 1615.9897 1641.7452 2957.9688 2961.5332 2967.4794 2972.4708 2975.5743 2981.2980 3038.3871 3051.5083 3053.5997 3064.8481 3068.1290 3075.1652 3081.2968 3119.2688 3133.4538 3145.9239 3162.9379 3174.5462 3493.2345 3588.2525
redmass: 3.3635 4.3882 3.4369 5.0667 3.6758 3.6420 1.3942 2.6350 4.2509 3.5516 4.3894 5.2535 1.1781 3.6435 2.0814 1.5721 3.7810 3.1226 3.2410 2.2211 5.0154 2.8806 2.6075 4.4399 2.9543 2.6662 1.1921 5.4431 3.8543 4.2387 5.0013 2.5213 2.9232 2.5647 6.0318 2.0821 5.9667 2.2043 3.0717 3.9888 1.6185 2.2137 1.9118 1.4288 1.2740 2.3888 1.9046 1.8690 1.3902 2.2633 2.0543 2.0137 2.2599 1.7891 1.6984 1.8599 2.0924 2.1772 1.9111 1.8759 1.0502 3.3390 1.2450 1.8796 1.8145 1.2728 3.6829 1.9666 1.6598 1.4422 1.5101 1.5169 1.4427 2.0873 2.0585 1.2606 1.7873 2.2624 1.2702 1.9425 1.2258 1.0834 1.0466 1.0553 1.1526 1.0689 2.0428 1.0575 2.2239 5.9500 6.8601 4.3572 6.0491 6.7630 1.0674 1.0458 1.0366 1.0495 1.0635 1.0698 1.1023 1.0983 1.0967 1.0987 1.0992 1.0997 1.1009 1.0879 1.0867 1.0929 1.0966 1.0995 1.0750 1.0786
irintensity: 0.7761 0.3629 1.2786 0.0307 0.0880 0.9447 1.1316 3.8010 3.9906 3.0430 4.6347 2.1840 0.0380 1.0097 1.6644 0.4822 3.9153 5.2221 15.7353 1.0089 5.0364 0.2392 0.9707 6.4957 27.1031 22.6917 61.3646 21.3088 7.0780 6.8820 1.8282 9.7363 24.5294 26.1340 8.3509 49.5144 8.7398 62.3088 43.1633 2.6797 1.4306 9.5767 11.3997 5.9593 2.8405 6.5896 0.7270 0.1151 0.1042 0.1526 0.4420 3.9604 7.6085 13.0312 11.7006 39.3455 5.1876 43.7889 4.6942 10.2902 0.3884 28.0982 4.4458 8.2858 83.1377 1.7822 4.1485 52.6357 10.0249 12.6881 42.6331 9.8435 35.1158 15.2833 76.4584 13.6982 15.9981 31.2469 52.2550 94.0632 29.1679 3.0693 3.4495 2.0691 64.7634 33.7251 33.5415 17.8905 202.7682 286.4161 532.2576 2.7345 18.9817 310.2839 10.1952 28.3905 44.8683 14.2858 22.6104 34.7730 20.7293 37.7460 20.3083 58.8249 65.8852 46.1457 13.0612 8.6653 0.1990 23.0337 31.5938 8.2277 36.7309 47.6729
temp: 298.150 k
press: 1.00000 atm
elementType: 8 8 7 7 6 6 6 6 6 6 6 6 6 6 6 6 6 6 6 6 1 1 1 1 1 1 1 1 1 1 1 1 1 1 1 1 1 1 1 1
symmnumber: 1
zpe: 864332.1 jmol-1
zpe.correction: 0.329207 hartree
zpe.thermalcorrener: 0.349105 hartree
zpe.thermalcorrenthalpy: 0.350050 hartree
zpe.thermalcorrgfe: 0.279411 hartree
zpe.sumelectzpe: -880.193288 hartree
zpe.sumelectthermal: -880.173389 hartree
zpe.sumelectthermalent: -880.172445 hartree
zpe.sumelectthermalfe: -880.243083 hartree
dipole: -1.6814 -1.2568 -0.1058
dipole: 2.1018
quadrupole: -96.4030 -123.6461 -121.4617
quadrupole: -11.7181 3.2443 -11.6262
quadrupole: 17.4339 -9.8092 -7.6247 -11.7181 3.2443 -11.6262
hfenergy: -880.5224944 hartree
pointgroup: C01 [X(C16H20N2O2)]
dipole: 0.6747234 0.4724885 -0.0727548 debye
polarizability: 256.2822094|18.0197923|220.690257|-23.3196093|7.3223696|137.0820086 unknown
InChI: InChI=1S/C16H20N2O2/c1-10(2)9-13-15(19)14(16(20)18-13)11(3)17-12-7-5-4-6-8-12/h4-8,10,13,17-18H,9H2,1-3H3
charge 0 multiplicity 1
40 atoms
O  0.025634 0.810596 -1.141936
O  -1.518989 -3.346872 0.831165
N  -2.479016 -1.255757 0.340361
N  2.213749 -1.388986 -0.580497
C  -2.152236 0.057644 -0.233314
C  -2.405681 1.274863 0.694399
C  -3.857532 1.833437 0.71669
C  -0.641374 -0.100966 -0.563749
C  -0.223129 -1.444815 -0.163993
C  -1.421931 -2.162711 0.374162
C  -4.256709 2.467621 -0.637965
C  -4.908965 0.790171 1.168216
C  1.025823 -2.056156 -0.370382
C  1.140781 -3.56698 -0.447129
C  2.657213 -0.074867 -0.221384
C  3.762623 0.458967 -0.930622
C  2.113576 0.634516 0.877072
C  4.311105 1.701707 -0.552449
C  2.669959 1.875189 1.247384
C  3.766272 2.418259 0.537956
H  -2.682504 0.212986 -1.195551
H  -2.096475 0.994139 1.721153
H  -1.724615 2.079169 0.352034
H  -3.854181 2.646826 1.473324
H  -3.394425 -1.506381 0.711631
H  -4.308686 1.709829 -1.442692
H  -3.528427 3.238641 -0.9495
H  -5.252905 2.942803 -0.57014
H  -5.058413 0.008823 0.396932
H  -5.891657 1.270584 1.329124
H  -4.614059 0.299016 2.114832
H  2.959606 -1.976861 -0.965467
H  0.88424 -3.919321 -1.464912
H  0.400386 -4.020339 0.235607
H  2.155613 -3.920315 -0.191785
H  4.176399 -0.087276 -1.787505
H  1.276841 0.214686 1.441649
H  5.158959 2.111137 -1.112346
H  2.244526 2.41948 2.097626
H  4.189701 3.385012 0.830006
