program: Gaussian 09
title: 000264931
version: EM64L-G09RevD.01
frameworkgroup: C1[X(C19H22N2O)]
method: RPBEPBE
basis: SDD
operation: Freq
keyword: #p
keyword: freq=noraman
keyword: PBEPBE/SDD
title: #p freq=noraman PBEPBE/SDD
converged: YES YES NO NO
title: Mulliken charges:
elementType: O N N C C C C C C C C C C C C C C C C C C C H H H H H H H H H H H H H H H H H H H H H H
charge: -0.269265 -0.075818 -0.470706 0.205932 0.049021 -0.517654 -0.506629 0.037629 0.215089 0.221784 -0.023461 -0.415471 0.186891 0.180555 -0.886434 -0.847038 -0.626462 -0.511406 -0.362019 0.281127 -0.346709 -0.538205 0.232877 0.209624 0.179844 0.232922 0.214468 0.188057 0.297037 0.235907 0.251831 0.237247 0.240891 0.245491 0.209001 0.228917 0.222998 0.184674 0.253528 0.231674 0.247103 0.241992 0.216358 0.216808
chargesum: 0.00000
title: Mulliken charges with hydrogens summed into heavy atoms:
elementType: O N N C C C C C C C C C C C C C C C C C C C
charge: -0.269265 -0.075818 -0.173669 0.205932 0.049021 -0.075153 -0.093863 0.037629 0.215089 0.221784 -0.023461 -0.012945 0.186891 0.180555 -0.161449 -0.151655 0.010126 -0.257878 -0.130344 0.281127 -0.099606 0.136953
polarizability: 3.60686266e+02 5.53314571e+00 2.44858646e+02 9.05835106e-01 -5.69136256e-02 1.17918068e+02
1716.lowfreq: -4.1401 -0.0006 -0.0003 0.0009 2.8107 4.4136 37.9258 43.8168 50.0845
frequency: 37.3949 43.7968 50.0737 88.1764 101.7068 114.9125 119.5584 134.4158 168.2690 187.6656 193.4857 205.4278 232.2272 240.9358 254.3439 254.5391 281.9892 299.7365 328.3565 343.0477 350.0368 370.7008 382.8737 399.6701 413.6274 435.5593 454.6390 460.4112 483.5941 512.9280 534.0580 559.4288 576.6454 615.4450 629.1331 650.9156 654.8272 683.2284 741.8038 745.4490 783.8911 793.1600 806.9369 810.4833 855.9160 867.0513 892.0140 932.6033 955.1818 968.1675 984.1722 1000.2673 1010.8837 1020.7306 1027.6135 1039.0363 1045.7749 1061.0468 1080.1454 1106.1165 1114.1615 1115.5337 1122.1465 1135.2945 1152.2082 1159.8712 1194.7432 1200.4726 1212.2222 1231.1048 1265.0606 1269.4833 1289.2828 1293.6569 1320.0433 1332.4334 1341.6539 1348.0977 1371.5569 1383.6501 1397.1024 1399.5023 1406.7788 1418.3374 1428.5109 1433.1942 1443.4583 1456.3663 1460.2021 1463.7085 1463.9021 1464.5959 1472.7274 1476.2683 1477.8288 1479.8213 1482.6894 1486.7483 1490.5308 1502.7751 1591.1442 1591.9513 1623.6757 1632.2310 2774.9109 2830.9016 2850.6439 2948.6986 2964.8833 2966.1185 2970.8480 2992.7866 3014.6737 3020.5618 3030.1734 3031.8611 3040.3182 3044.2433 3071.4371 3074.3059 3102.1020 3117.1850 3135.0436 3170.0266 3185.6762 3621.1714
redmass: 1.3025 2.4715 3.3732 3.2792 4.0867 2.8030 2.8676 2.3940 1.3625 2.5895 2.1586 2.3722 1.9067 2.5758 1.4106 1.6232 5.1001 2.5969 2.1857 3.3825 3.3041 4.4322 3.3732 5.8213 4.6742 2.0669 1.9415 2.3074 3.5853 4.5673 3.6160 4.1291 3.7171 3.7987 4.0014 4.7198 5.4545 3.8987 4.0033 4.1361 3.4310 4.0053 1.5793 3.3115 1.7117 3.3796 2.5749 1.3395 3.8754 2.4885 1.7536 4.0793 2.6125 1.9249 1.5995 1.5846 1.7830 2.0116 1.8247 2.0124 1.2614 1.4049 2.2578 1.9186 1.6656 1.6936 1.6662 2.2858 1.5446 1.7358 1.9504 2.0471 1.7090 1.6887 2.3331 3.7346 2.3942 1.8547 1.5813 4.0020 1.5106 1.2148 2.5682 2.8040 1.2010 1.5017 1.1235 1.8081 1.1172 1.3405 1.0600 1.1682 2.0499 1.1988 1.1100 1.1669 1.0655 1.2038 1.4384 1.8287 8.7898 7.1745 6.6916 7.9372 1.0713 1.0685 1.0593 1.0334 1.0550 1.0457 1.0404 1.0843 1.0718 1.0977 1.0892 1.1034 1.0970 1.0944 1.0978 1.1008 1.0945 1.0985 1.0893 1.0952 1.0899 1.0797
irintensity: 0.5244 0.3943 0.7869 3.4253 0.3071 0.3682 3.2042 2.4320 4.5877 2.5104 2.1439 2.0811 0.9800 2.2522 0.0310 0.3349 1.9092 0.9651 5.8615 0.2426 2.3460 0.6483 3.2000 0.6957 2.6572 7.7186 52.7160 34.7398 1.9308 7.4811 1.6300 1.3698 5.8752 2.7282 3.5115 1.0764 0.7271 16.1281 1.1517 1.0204 7.8362 15.0147 55.2706 8.7826 21.6689 3.7894 4.7323 0.0092 11.1418 6.8242 2.9968 41.8009 9.9801 15.6607 1.4334 3.2117 2.9313 4.0727 15.1700 14.2532 0.2034 7.3719 1.7180 50.3691 21.4538 31.3454 28.0084 139.0675 1.8607 17.9969 12.7663 4.0931 1.7873 21.8587 11.1535 100.3428 1.8754 7.2212 33.2471 4.5978 15.0643 10.2448 1.6954 36.7701 7.3760 30.8836 16.0997 56.3826 28.6515 3.0355 12.5671 5.8727 84.2954 54.0275 15.4757 15.2479 14.5414 20.9102 18.4379 31.7358 13.2582 20.7918 21.6537 40.5478 71.5793 59.0197 233.8698 59.1390 72.3089 12.4277 23.9717 26.9721 54.0845 35.1932 64.3078 53.6604 19.2399 24.4154 21.5239 36.4372 28.7315 34.7431 12.7071 10.4062 8.7263 42.6911
temp: 298.150 k
press: 1.00000 atm
elementType: 8 7 7 6 6 6 6 6 6 6 6 6 6 6 6 6 6 6 6 6 6 6 1 1 1 1 1 1 1 1 1 1 1 1 1 1 1 1 1 1 1 1 1 1
symmnumber: 1
zpe: 961388.0 jmol-1
zpe.correction: 0.366173 hartree
zpe.thermalcorrener: 0.386709 hartree
zpe.thermalcorrenthalpy: 0.387654 hartree
zpe.thermalcorrgfe: 0.317803 hartree
zpe.sumelectzpe: -920.358660 hartree
zpe.sumelectthermal: -920.338124 hartree
zpe.sumelectthermalent: -920.337179 hartree
zpe.sumelectthermalfe: -920.407030 hartree
dipole: 1.8359 0.1183 0.7838
dipole: 1.9997
quadrupole: -130.1922 -104.7870 -137.5596
quadrupole: 3.4289 3.3892 -0.2978
quadrupole: -6.0126 19.3926 -13.3800 3.4289 3.3892 -0.2978
hfenergy: -920.7248329 hartree
pointgroup: C01[X(C19H22N2O1)]
dipole: 0.720552 0.0672419 0.3086508 debye
polarizability: 360.329849|8.4648529|245.2043743|1.1142709|-1.0298289|117.9287561 unknown
InChI: InChI=1S/C19H22N2O/c1-11-16-10-21(3)8-7-14(16)12(2)19-18(11)15-9-13(22-4)5-6-17(15)20-19/h5-6,9,20H,7-8,10H2,1-4H3
charge 0 multiplicity 1
44 atoms
O  -5.199279 -1.505624 0.031933
N  4.479474 -1.179359 -0.295226
N  -1.049625 2.250082 -0.046711
C  2.428835 0.805734 -0.007494
C  2.047206 -0.576066 0.00393
C  3.906007 1.185412 0.015782
C  3.119049 -1.668613 0.00831
C  -0.308539 0.066803 0.003626
C  0.677237 -0.957379 0.026272
C  1.455172 1.840229 -0.040118
C  0.100684 1.442729 -0.033091
C  4.803897 0.030532 0.4846
C  -1.77273 0.059661 0.004374
C  -2.192618 1.434184 -0.025576
C  0.235607 -2.411147 0.085537
C  1.838519 3.310892 -0.075156
C  5.481332 -2.250513 -0.162645
C  -2.760348 -0.963059 0.021977
C  -3.555019 1.801223 -0.031581
C  -4.123058 -0.590524 0.015372
C  -4.518614 0.777349 -0.009784
C  -4.865906 -2.92735 0.056328
H  4.228733 1.486148 -1.001771
H  4.065276 2.060817 0.674996
H  3.099584 -2.190161 1.006843
H  2.870542 -2.437282 -0.748757
H  5.866325 0.286402 0.315943
H  4.670645 -0.135297 1.586498
H  -1.056595 3.266119 -0.053457
H  -0.327202 -2.692904 -0.82587
H  1.076053 -3.114296 0.187327
H  -0.436988 -2.577768 0.94831
H  2.115398 3.691202 0.928328
H  2.702254 3.490354 -0.738891
H  1.012972 3.942894 -0.450082
H  6.474909 -1.870971 -0.460532
H  5.220987 -3.089702 -0.833497
H  5.561404 -2.65755 0.878752
H  -2.468755 -2.01468 0.036259
H  -3.866153 2.851273 -0.054116
H  -5.588771 1.004706 -0.013946
H  -5.832974 -3.452128 0.066537
H  -4.289102 -3.193707 0.964833
H  -4.291125 -3.225266 -0.843566
