program: Gaussian 09
title: 000264902
version: EM64L-G09RevD.01
frameworkgroup: C1[X(C18H18O2)]
method: RPBEPBE
basis: SDD
operation: Freq
keyword: #pfreq=noraman
keyword: PBEPBE/SDD
title: #p freq=noraman PBEPBE/SDD
converged: YES YES NO NO
title: Mulliken charges:
elementType: O O C C C C C C C C C C C C C C C C C C H H H H H H H H H H H H H H H H H H
charge: -0.179074 -0.265136 0.084903 0.340507 -0.496661 0.065128 -0.534968 0.131436 0.069713 -0.687745 -0.756277 -0.544482 -0.450521 0.167605 0.332203 -0.407012 -0.586876 0.325867 -0.365904 -0.535758 0.237776 0.227406 0.232072 0.229114 0.240206 0.244850 0.238658 0.226531 0.242749 0.250109 0.244602 0.242062 0.244111 0.256349 0.249573 0.220417 0.220502 0.245967
chargesum: 0.00000
title: Mulliken charges with hydrogens summed into heavy atoms:
elementType: O O C C C C C C C C C C C C C C C C C C
charge: -0.179074 -0.265136 0.084903 0.340507 -0.031479 0.065128 -0.073782 0.131436 0.069713 -0.202690 -0.048339 -0.049772 -0.208459 0.167605 0.332203 -0.162902 -0.330527 0.325867 -0.116330 0.151128
polarizability: 3.40746160e+02 2.64504493e+01 2.03891871e+02 3.45825426e+00 -4.43203431e-01 1.12777382e+02
1716.lowfreq: -15.0693 -9.3344 0.0006 0.0006 0.0008 0.7115 35.0943 68.5095 72.9257
frequency: 35.0612 68.4981 72.9120 103.0220 118.3901 139.8181 178.6220 188.2726 212.5626 218.6934 228.2902 243.9069 252.8286 260.3561 286.3050 292.2530 340.2052 373.1878 420.4248 430.2456 449.2163 468.3770 504.3839 525.7495 542.6835 571.5153 585.7259 601.0815 620.7440 650.8655 660.8911 698.4944 736.0030 741.2673 759.9851 786.7751 826.7096 842.0409 849.9808 881.7383 904.0074 905.6785 918.3826 936.6131 951.2333 956.0464 979.1953 987.7233 993.0112 1013.1006 1040.6361 1069.5152 1086.0458 1111.6369 1113.0964 1116.7431 1120.6977 1143.6769 1155.7570 1162.2725 1191.2308 1196.0766 1212.3238 1221.7192 1233.3829 1249.8533 1276.6276 1289.1174 1292.3536 1321.8610 1345.1018 1377.1706 1390.4523 1406.8968 1421.3109 1424.9111 1427.4160 1451.2594 1454.6832 1461.0097 1466.2250 1469.9527 1471.9347 1479.2910 1484.1337 1563.1379 1590.8196 1615.9405 1637.4585 1665.3305 2957.3895 2958.2137 2959.4979 2979.5955 2981.3495 2994.3121 3013.3692 3018.1265 3023.7609 3044.3825 3062.5598 3080.1381 3087.3288 3123.6386 3134.2520 3149.6045 3154.7188 3168.3390
redmass: 5.5047 3.4876 4.0830 5.1937 3.5262 3.5796 3.4502 1.8070 1.6908 1.6744 2.1044 2.5076 2.5317 1.9296 2.3721 4.4809 2.9320 3.4546 4.1203 2.7803 4.2369 4.1891 3.3304 4.5753 3.1154 4.0569 4.1820 3.3468 4.0117 3.6734 4.9327 3.1055 4.0549 4.8926 2.8535 1.3953 1.4276 2.9950 1.4727 2.4436 3.2332 2.4016 2.8993 2.2812 1.7621 1.6180 2.7243 1.6701 4.0686 2.0715 2.2934 2.4556 2.3311 1.2671 1.6201 1.4506 1.2686 1.4398 1.4333 2.4535 1.5384 1.6345 2.0622 2.5898 1.8713 1.9799 1.6316 2.0513 1.8095 1.5585 2.2757 1.2852 3.8536 5.2759 1.1986 1.1011 1.5196 1.6281 1.3675 1.0757 1.0512 1.1350 1.2920 1.9007 1.0693 6.6803 7.9869 7.0916 8.3766 11.8633 1.0344 1.0638 1.0640 1.0609 1.0339 1.0674 1.0883 1.0931 1.0986 1.1038 1.1028 1.1000 1.1008 1.0992 1.0893 1.0910 1.0949 1.0953
irintensity: 0.2778 5.2831 3.2369 0.6211 0.4737 6.3105 1.8582 0.6030 1.8618 0.4070 0.6960 4.7951 5.3672 1.2283 4.6077 0.3789 0.3980 0.3080 13.1283 4.5316 2.8714 8.8020 0.5449 4.4772 4.6230 8.8279 1.8958 5.4039 0.5768 3.7582 2.5960 2.2199 0.6277 4.1004 7.0744 34.8001 37.2271 3.5554 34.6609 1.3391 7.6168 6.5403 3.9570 6.0118 1.5371 0.3566 2.1367 31.8624 42.0140 23.3823 16.3328 4.2406 17.0539 1.4073 39.8012 10.7216 2.4014 17.0461 6.1503 27.8399 4.7017 9.4460 20.4751 119.8679 33.6963 47.6648 17.8673 50.3421 8.3100 9.8843 16.6423 12.0913 16.9145 51.5433 12.6569 15.5147 27.5413 14.0445 7.8337 16.8818 13.6667 41.2545 66.4257 0.9707 7.7450 6.3869 6.7374 162.3197 21.9983 176.5394 84.0718 45.0252 18.2888 12.9948 24.6511 14.3139 35.4339 11.9787 6.8633 50.5748 27.7875 18.8424 22.8776 29.4946 11.6292 11.2459 17.4624 12.0205
temp: 298.150 k
press: 1.00000 atm
elementType: 8 8 6 6 6 6 6 6 6 6 6 6 6 6 6 6 6 6 6 6 1 1 1 1 1 1 1 1 1 1 1 1 1 1 1 1 1 1
symmnumber: 1
zpe: 809947.9 jmol-1
zpe.correction: 0.308493 hartree
zpe.thermalcorrener: 0.325959 hartree
zpe.thermalcorrenthalpy: 0.326903 hartree
zpe.thermalcorrgfe: 0.263967 hartree
zpe.sumelectzpe: -845.716336 hartree
zpe.sumelectthermal: -845.698870 hartree
zpe.sumelectthermalent: -845.697926 hartree
zpe.sumelectthermalfe: -845.760862 hartree
dipole: 3.1291 -2.7461 0.9085
dipole: 4.2611
quadrupole: -131.7059 -103.5761 -119.2783
quadrupole: -4.5100 -4.2786 0.5013
quadrupole: -13.5191 14.6106 -1.0915 -4.5100 -4.2786 0.5013
hfenergy: -846.0248288 hartree
pointgroup: C01 [X(C18H18O2)]
dipole: 1.2063876 1.1095822 -0.3520738 debye
polarizability: 341.8242568|-23.4011221|202.80124|-4.070435|0.1583754|112.7899161 unknown
InChI: InChI=1S/C18H18O2/c1-18-8-7-14-13-4-3-12(20-2)9-11(13)10-15(14)16(18)5-6-17(18)19/h3-5,9H,6-8,10H2,1-2H3
charge 0 multiplicity 1
38 atoms
O  -5.320089 -0.484971 0.543142
O  5.501074 0.111697 -0.000884
C  -2.945791 -0.383567 -0.217408
C  -2.009358 0.814166 -0.021725
C  -2.438463 -1.614281 0.581131
C  -0.588277 0.540029 -0.019272
C  -0.984161 -1.984029 0.171094
C  -0.102551 -0.759716 0.056046
C  -4.304909 0.187414 0.249385
C  0.564936 1.536299 -0.059227
C  -3.106156 -0.731405 -1.73317
C  -4.203263 1.730625 0.275756
C  -2.708516 1.975997 0.190884
C  1.364873 -0.727999 0.050412
C  1.792311 0.633769 -0.020606
C  2.326661 -1.766632 0.106426
C  3.154402 0.973847 -0.040034
C  4.108469 -0.080079 0.012888
C  3.695759 -1.4374 0.086226
C  5.998134 1.48594 -0.080663
H  -3.116881 -2.472838 0.426432
H  -2.456881 -1.370699 1.660722
H  -0.982955 -2.538401 -0.790876
H  -0.561801 -2.685887 0.917266
H  0.539582 2.232363 0.80322
H  0.5376 2.164116 -0.971867
H  -3.822989 -1.563344 -1.855708
H  -3.475301 0.138325 -2.306115
H  -2.134981 -1.026926 -2.166462
H  -4.673814 2.133776 1.193762
H  -4.782069 2.153527 -0.5733
H  -2.260305 2.961647 0.350275
H  2.020717 -2.817132 0.163009
H  3.466666 2.021427 -0.092765
H  4.470409 -2.209095 0.125989
H  5.675237 2.084096 0.793964
H  5.664478 1.982679 -1.012812
H  7.094304 1.395465 -0.081931
