program: Gaussian 09
title: 000264892
version: EM64L-G09RevD.01
frameworkgroup: C1[X(C11H12BrNO4)]
method: RPBEPBE
basis: SDD
operation: Freq
keyword: #p
keyword: freq=noraman
keyword: PBEPBE/SDD
title: #p freq=noraman PBEPBE/SDD
converged: YES YES NO NO
title: Mulliken charges:
elementType: Br O O O O N C C C C C C C C C C C H H H H H H H H H H H H
charge: 0.029434 -0.269523 -0.190623 -0.207380 -0.205011 0.024292 -0.304653 -0.360127 -0.623253 -0.683022 0.303108 0.377568 -0.368941 -0.275933 0.382463 -0.328586 -0.345621 0.244200 0.230677 0.198881 0.224558 0.324438 0.224190 0.220205 0.212211 0.271800 0.311245 0.292857 0.290548
chargesum: 0.00000
title: Mulliken charges with hydrogens summed into heavy atoms:
elementType: Br O O O O N C C C C C C C C C C C
charge: 0.029434 -0.269523 -0.190623 -0.207380 -0.205011 0.024292 0.170223 0.063312 -0.298816 -0.026416 0.303108 0.377568 -0.097141 0.035312 0.382463 -0.035730 -0.055073
polarizability: 2.49425273e+02 -1.14120461e+00 1.34524542e+02 -3.51171209e+00 -1.70663069e+01 1.27495839e+02
1716.lowfreq: -3.8389 -0.0006 -0.0001 0.0003 3.5103 6.2905 16.5134 21.7729 55.3592
frequency: 16.4262 21.7399 55.3524 57.5480 68.8496 81.2527 90.5056 110.2982 125.0798 164.3246 209.1206 222.6752 228.4238 262.5497 286.4873 317.3589 332.4754 373.8111 415.4867 467.7478 498.2487 506.2782 550.4026 611.5700 625.5905 664.3603 672.0865 721.7886 733.6565 741.3544 755.5201 798.7091 844.6141 845.8527 874.6918 892.5463 913.7282 987.8672 1000.5378 1001.3845 1030.2734 1058.7701 1070.9431 1093.3448 1099.8374 1110.3242 1119.5249 1152.5120 1175.0610 1193.9944 1221.2015 1231.6710 1288.1949 1290.1929 1290.9198 1338.2614 1345.1415 1363.8053 1392.4334 1402.6391 1423.5406 1458.0887 1468.8346 1474.0629 1477.0449 1485.1565 1590.7679 1607.4902 1649.0487 2978.4359 2980.6710 3015.0040 3030.6144 3073.2558 3082.3510 3083.6427 3102.3217 3172.6339 3181.6293 3192.7035 3216.6831
redmass: 5.5717 7.2915 9.9212 3.5033 7.1612 2.3692 4.0257 10.7503 3.3827 9.6922 6.5885 2.0655 1.7472 5.2496 3.8414 7.6820 5.8058 6.2328 3.0091 4.1713 3.3889 7.4635 7.5255 6.2795 6.3208 4.7504 4.0707 6.6941 4.8669 5.0568 1.3635 6.3190 1.2656 3.0025 1.5623 1.7632 1.7445 1.3335 3.0763 1.3384 3.2660 3.0997 2.2794 3.0559 1.8303 1.2699 1.8048 1.7659 1.4280 2.1770 6.3473 1.4181 1.3082 1.2748 1.1194 1.4066 1.4867 8.2343 1.2035 11.2883 3.9360 1.0862 2.3705 1.0546 1.0433 1.0785 7.3902 7.1280 10.6625 1.0573 1.0386 1.0607 1.0993 1.1012 1.0996 1.1006 1.0903 1.0896 1.0914 1.0970 1.0952
irintensity: 0.1088 0.2043 3.1297 0.3101 0.2364 0.1284 0.0886 1.2387 0.2937 3.5838 3.1875 1.5904 0.5744 3.4728 5.5729 0.0571 0.1151 12.0042 0.0180 4.7796 14.3700 1.1938 24.1585 2.2326 3.2253 22.1424 16.8229 6.6981 7.6777 10.6520 27.1374 11.5223 3.8029 20.3913 82.2120 2.4450 45.2361 0.6106 3.4878 0.0140 112.6871 226.5217 326.2774 30.4204 22.5957 25.6065 123.5449 262.7543 16.0374 61.2012 337.9116 1.7786 14.3200 5.0070 1.7450 17.6933 12.8788 86.4305 8.1403 21.0514 48.2295 10.6753 69.3472 3.6774 12.7648 16.1108 63.1370 67.4714 172.2800 36.0364 27.1818 16.7907 8.6657 5.4914 40.7849 53.1088 9.2273 0.5182 1.7735 2.8590 3.9392
temp: 298.150 k
press: 1.00000 atm
elementType: 35 8 8 8 8 7 6 6 6 6 6 6 6 6 6 6 6 1 1 1 1 1 1 1 1 1 1 1 1
symmnumber: 1
zpe: 563209.8 jmol-1
zpe.correction: 0.214515 hartree
zpe.thermalcorrener: 0.231756 hartree
zpe.thermalcorrenthalpy: 0.232700 hartree
zpe.thermalcorrgfe: 0.165320 hartree
zpe.sumelectzpe: -794.134799 hartree
zpe.sumelectthermal: -794.117559 hartree
zpe.sumelectthermalent: -794.116615 hartree
zpe.sumelectthermalfe: -794.183995 hartree
dipole: 5.3836 1.1922 2.3116
dipole: 5.9789
quadrupole: -141.9378 -108.5924 -106.7637
quadrupole: 7.7470 1.4768 0.2925
quadrupole: -22.8398 10.5056 12.3343 7.7470 1.4768 0.2925
hfenergy: -794.3493144 hartree
pointgroup: C01 [X(C11H12Br1N1O4)]
dipole: 2.2022311 0.1412598 0.8145731 debye
polarizability: 247.6200677|-5.0139401|142.7833446|-15.169949|-12.4550243|121.042242 unknown
InChI: InChI=1S/C11H12BrNO4/c1-2-3-10(12)11(14)17-9-6-4-8(5-7-9)13(15)16/h4-7,10H,2-3H2,1H3
charge 0 multiplicity 1
29 atoms
Br 3.393536 -2.264725 -1.345411
O  0.836981 -0.606815 0.228436
O  1.66282 0.900426 -1.392741
O  -5.479412 -0.628872 0.952331
O  -5.323019 0.917623 -0.718597
N  -4.799206 0.08162 0.114703
C  4.372778 0.349899 -0.366592
C  4.339965 1.54106 0.629339
C  3.190802 -0.59713 -0.158188
C  5.56107 2.466714 0.438948
C  1.848231 0.00568 -0.547395
C  -0.555998 -0.354068 0.108221
C  -1.333795 -1.118226 1.011846
C  -1.153704 0.553824 -0.802208
C  -3.325096 -0.072588 0.111882
C  -2.730471 -0.980046 1.018111
C  -2.556159 0.688893 -0.793094
H  4.359143 0.730019 -1.403963
H  5.309922 -0.21959 -0.22917
H  4.323286 1.157812 1.669602
H  3.410537 2.12415 0.482939
H  3.141159 -1.020204 0.856528
H  5.534034 3.310228 1.151797
H  5.582726 2.887541 -0.583076
H  6.507237 1.917177 0.599405
H  -0.827624 -1.81029 1.690112
H  -0.542937 1.134905 -1.492612
H  -3.362152 -1.553508 1.700593
H  -3.058854 1.37739 -1.477243
