program: Gaussian 09
title: 000264897
version: EM64L-G09RevD.01
frameworkgroup: C1[X(C16H19N3O)]
method: RPBEPBE
basis: SDD
operation: Freq
keyword: #p
keyword: freq=noraman
keyword: PBEPBE/SDD
title: #p freq=noraman PBEPBE/SDD
converged: YES YES NO NO
title: Mulliken charges:
elementType: O N N N C C C C C C C C C C C C C C C C H H H H H H H H H H H H H H H H H H H
charge: -0.293697 -0.496796 -0.190653 -0.021289 0.143401 0.338447 0.433899 -0.118851 -0.376679 -0.332367 -0.474282 -0.428726 -0.233279 -0.685782 -0.685311 -0.235837 -0.280103 -0.244677 0.292180 -0.657760 0.219370 0.301807 0.208304 0.236251 0.371813 0.237499 0.224931 0.204986 0.221699 0.230818 0.230913 0.205155 0.221642 0.223852 0.224981 0.227555 0.290025 0.233103 0.233460
chargesum: 0.00000
title: Mulliken charges with hydrogens summed into heavy atoms:
elementType: O N N N C C C C C C C C C C C C C C C C
charge: -0.293697 -0.124982 -0.190653 -0.021289 0.143401 0.338447 0.433899 0.100519 -0.074871 -0.124063 -0.238031 -0.191227 -0.008349 -0.028280 -0.027601 -0.011985 -0.055123 -0.017122 0.292180 0.098829
polarizability: 2.96109636e+02 -7.60660374e+00 2.58640156e+02 2.98504259e-01 -3.13474934e-01 1.02304987e+02
1716.lowfreq: -6.5960 -0.0008 -0.0005 0.0004 1.2368 6.3745 21.1485 36.9564 45.7004
frequency: 20.9056 36.8107 45.6929 54.7429 81.7991 115.7009 128.5335 129.5542 177.5307 179.1719 199.5249 206.1189 239.0384 242.0200 247.9592 280.0316 293.7412 338.4726 364.8342 382.8586 411.9747 421.6226 440.1682 453.1315 472.5560 507.0262 511.6645 555.7850 568.1529 615.7984 647.7197 669.2105 684.7799 736.4179 742.8411 782.3962 783.8923 797.7411 831.3926 853.2509 864.8137 873.9244 875.6152 897.1682 918.9938 924.8916 944.9941 954.1949 954.9736 983.1282 984.6521 991.8733 1028.1904 1051.7395 1087.2336 1104.7729 1119.2072 1127.6590 1154.3959 1156.6340 1178.9435 1181.1574 1195.6941 1211.3523 1235.7043 1264.0433 1278.8136 1296.1243 1305.1059 1308.0886 1363.2017 1374.7498 1375.3709 1394.4519 1409.0422 1413.7048 1421.2847 1448.0347 1455.4161 1465.7939 1467.5670 1478.9690 1480.5762 1481.6454 1487.4221 1504.7402 1544.7189 1592.0118 1596.6961 1602.8441 1633.6832 1645.2196 2964.6115 2974.3533 2976.2616 3008.6036 3029.4119 3040.3162 3067.0298 3075.3850 3082.5151 3086.2387 3116.0143 3121.8533 3123.1974 3127.7162 3140.9774 3152.0110 3161.2456 3189.2706 3425.6333
redmass: 4.3951 2.7470 4.3130 3.8203 4.1489 3.7263 4.0123 4.0220 4.3918 4.0664 1.0298 2.0207 1.1165 3.4686 1.7354 4.2090 3.5058 2.6401 2.9942 3.9149 3.9163 2.9953 3.6165 3.9949 3.3818 6.1137 7.0398 4.1275 3.0108 6.4258 3.4284 5.0294 5.3340 1.4437 5.4731 5.5649 1.9685 1.2708 1.4858 2.9547 3.8936 4.0012 1.7055 1.4781 1.1835 1.3556 2.0519 1.3970 1.4647 2.3622 1.3327 1.3519 2.9467 2.4472 2.2895 2.5097 1.3116 2.3615 1.5882 1.7434 2.0229 1.1126 1.3229 3.0884 1.8862 1.8805 1.6267 1.6191 1.3636 2.3599 1.7850 1.5867 1.5840 1.2300 2.7042 1.2188 5.4560 2.4291 2.3469 1.0507 1.0441 1.0581 1.0506 1.1148 1.0671 2.7255 2.6234 7.2132 5.5086 6.5853 6.3763 6.6398 1.0361 1.0352 1.0358 1.0843 1.0870 1.1019 1.0995 1.0984 1.1006 1.1000 1.0853 1.0964 1.0880 1.0866 1.0944 1.0967 1.1004 1.0943 1.0745
irintensity: 0.0619 0.1203 0.1465 1.7168 0.5717 5.8225 1.0487 0.9696 0.8658 3.1053 0.0269 5.7879 0.0012 0.8560 4.3392 3.4064 6.5461 2.2373 6.1892 14.8592 0.4071 10.2055 6.3543 0.1025 0.0764 6.4898 2.1673 23.6449 4.8174 18.0498 0.2920 9.6890 1.6923 0.6861 0.8975 1.5980 82.2056 2.9431 137.7401 4.4674 2.7758 15.9246 4.0381 24.7774 6.5904 5.0052 17.9747 4.3716 0.7754 141.0678 0.9976 5.6501 81.5892 82.3865 4.9598 5.6586 0.5749 148.2760 2.8156 4.6837 30.9933 1.9364 2.7829 8.3196 1.9499 23.0831 35.7883 13.6503 1.0686 29.9375 11.9283 41.8949 46.0176 28.5945 23.7459 26.5811 95.3552 0.0953 6.2297 5.9678 1.8603 26.6419 19.0605 29.9597 38.5890 432.3170 876.4819 38.3007 22.2982 31.4800 15.4215 242.9940 53.5402 27.8826 42.8422 1.9219 34.9362 31.7040 1.9743 81.2453 22.3231 49.2423 8.9717 0.3956 1.3504 2.1608 35.6559 39.9347 29.4535 4.7914 114.5363
temp: 298.150 k
press: 1.00000 atm
elementType: 8 7 7 7 6 6 6 6 6 6 6 6 6 6 6 6 6 6 6 6 1 1 1 1 1 1 1 1 1 1 1 1 1 1 1 1 1 1 1
symmnumber: 1
zpe: 838620.7 jmol-1
zpe.correction: 0.319414 hartree
zpe.thermalcorrener: 0.338543 hartree
zpe.thermalcorrenthalpy: 0.339488 hartree
zpe.thermalcorrgfe: 0.270887 hartree
zpe.sumelectzpe: -859.131828 hartree
zpe.sumelectthermal: -859.112699 hartree
zpe.sumelectthermalent: -859.111755 hartree
zpe.sumelectthermalfe: -859.180355 hartree
dipole: -4.0022 2.7203 0.0016
dipole: 4.8392
quadrupole: -93.0385 -117.9607 -124.9104
quadrupole: 2.9596 0.1126 -0.0934
quadrupole: 18.9314 -5.9909 -12.9405 2.9596 0.1126 -0.0934
hfenergy: -859.4512421 hartree
pointgroup: C01 [X(C16H19N3O1)]
dipole: -1.5303008 -1.1321086 -0.0353028 debye
polarizability: 295.1696718|9.6036907|258.385326|-6.667503|11.9239925|103.4997807 unknown
InChI: InChI=1S/C16H19N3O/c1-12(2)11-17-19(3)16(20)18-15-10-6-8-13-7-4-5-9-14(13)15/h4-12,18H,1-3H3
charge 0 multiplicity 1
39 atoms
O  -0.634124 3.198878 0.305487
N  -0.076487 0.899586 0.081741
N  -2.316197 1.563478 0.227037
N  -2.564375 0.199758 0.113119
C  2.014687 -0.366411 -0.097308
C  1.336574 0.912345 0.026622
C  3.463883 -0.375427 -0.157801
C  -4.046389 -1.750895 -0.000662
C  2.079654 2.103637 0.087421
C  1.325982 -1.624869 -0.162407
C  4.189955 0.858686 -0.094541
C  4.150534 -1.629294 -0.279923
C  3.502863 2.066661 0.025896
C  -4.893526 -2.050212 -1.266778
C  -4.75145 -2.283388 1.276179
C  -3.790796 -0.263905 0.12164
C  2.023831 -2.830096 -0.281113
C  3.451734 -2.835437 -0.340971
C  -0.940207 1.974452 0.209463
C  -3.3713 2.57247 0.361889
H  -3.063573 -2.250161 -0.100699
H  1.550875 3.053764 0.182578
H  0.231545 -1.671665 -0.119537
H  5.284576 0.835471 -0.141483
H  -0.582082 0.006107 0.023369
H  5.246265 -1.620406 -0.324253
H  4.054729 3.011777 0.075178
H  -5.875815 -1.542575 -1.214971
H  -5.080494 -3.136048 -1.35672
H  -4.378843 -1.710038 -2.182795
H  -4.136489 -2.106264 2.17628
H  -5.730157 -1.788082 1.424971
H  -4.934445 -3.370195 1.189457
H  -4.68087 0.383796 0.217981
H  1.474272 -3.776664 -0.32848
H  3.989985 -3.784933 -0.434051
H  -2.87338 3.550686 0.434082
H  -3.972609 2.397541 1.275033
H  -4.041935 2.565974 -0.519128
