program: Gaussian 09
title: 000264895
version: EM64L-G09RevD.01
frameworkgroup: C1[X(C12H28N2)]
method: RPBEPBE
basis: SDD
operation: Freq
keyword: #pfreq=noraman
keyword: PBEPBE/SDD
title: #p freq=noraman PBEPBE/SDD
converged: NO YES NO NO
title: Mulliken charges:
elementType: N N C C C C C C C C C C C C H H H H H H H H H H H H H H H H H H H H H H H H H H H H
charge: -0.125276 -0.090235 -0.115775 0.053156 -0.429161 -0.421713 -0.395302 -0.410485 -0.723286 -0.645503 -0.635992 -0.698268 -0.630261 -0.614047 0.206538 0.202037 0.184252 0.215718 0.193890 0.205781 0.240619 0.192922 0.211653 0.226097 0.213732 0.204582 0.217194 0.234930 0.186812 0.213220 0.214637 0.184538 0.237597 0.205594 0.207037 0.213955 0.231238 0.188619 0.217552 0.219897 0.187114 0.224391
chargesum: 0.00000
title: Mulliken charges with hydrogens summed into heavy atoms:
elementType: N N C C C C C C C C C C C C
charge: -0.125276 -0.090235 0.090763 0.255193 -0.029191 -0.022043 0.038240 0.027265 -0.087779 -0.010541 0.000781 -0.071681 0.007149 0.017355
polarizability: 1.50806074e+02 -6.75656185e-01 1.52451551e+02 1.89338793e+00 1.27657000e+00 1.34183287e+02
1716.lowfreq: -13.5879 -6.9222 -0.0007 0.0005 0.0009 8.4699 31.0117 37.7803 52.1545
frequency: 29.7606 37.5604 52.0938 58.2272 78.8405 89.5909 106.5459 127.2543 160.8844 190.5086 212.5437 222.5110 231.5256 234.5080 242.8821 248.6953 265.1646 293.4122 296.7702 317.1704 345.0861 354.8072 366.2525 381.6445 459.0883 476.7497 498.4095 539.8090 618.1373 726.6404 765.0144 789.7251 813.1184 821.9490 873.0965 892.9963 932.0262 966.9978 977.7316 998.9547 1031.6914 1033.2105 1039.1161 1052.0734 1057.2170 1076.2119 1086.1278 1087.5405 1099.4404 1107.8561 1122.5419 1134.2696 1141.0321 1149.5565 1190.0431 1212.2145 1217.9963 1244.8683 1250.8582 1258.2451 1262.3609 1271.3239 1285.1237 1302.2170 1310.6847 1332.1151 1342.4574 1349.1826 1367.3478 1371.7296 1385.0315 1391.2851 1416.5778 1418.7687 1440.3040 1445.1078 1456.0481 1461.2402 1463.3573 1468.1576 1470.6999 1475.3210 1475.6541 1476.3678 1476.6690 1477.6269 1481.2754 1483.5445 1486.1488 1490.0340 1490.8378 1496.8600 2833.7357 2834.5179 2841.0609 2846.1328 2855.4919 2858.9696 2966.4560 2968.6047 2969.9738 2974.1983 2985.2444 2985.7157 3007.7709 3012.4917 3015.7404 3023.2854 3026.5055 3027.9941 3028.9704 3037.6125 3062.2467 3064.1705 3066.9466 3068.2436 3074.3839 3078.8964 3080.6925 3091.3592
redmass: 2.7411 3.0371 3.0268 2.3771 2.3909 2.4246 2.2358 2.1874 1.7477 2.0490 1.7514 1.3413 1.1178 1.1841 1.3046 1.3485 1.2582 3.0105 2.3487 2.7057 2.3060 2.5839 2.0097 2.4300 2.1890 2.2725 2.6228 3.0211 3.0144 1.1792 1.4559 2.3320 2.5829 2.1704 1.6392 1.7237 1.5284 2.2338 1.9340 2.0115 1.6730 1.6990 2.0372 2.2481 2.4148 1.6143 1.3793 1.2927 1.6827 1.8675 1.9516 1.6690 1.7427 2.1722 2.0526 2.5388 1.5536 1.8080 1.6764 1.7105 1.4599 1.3865 1.2455 1.2421 1.1921 1.4324 1.3706 1.5019 1.3784 1.4002 1.2210 1.2114 1.1377 1.1435 1.1434 1.1722 1.0881 1.0544 1.0619 1.0518 1.0584 1.0498 1.0466 1.0482 1.0479 1.0452 1.0576 1.0539 1.0557 1.0706 1.0649 1.0789 1.0684 1.0580 1.0580 1.0717 1.0652 1.0602 1.0361 1.0378 1.0619 1.0602 1.0724 1.0670 1.0872 1.0979 1.0715 1.0722 1.0729 1.0944 1.0746 1.1018 1.0996 1.1010 1.0991 1.0991 1.1012 1.1006 1.0998 1.0983
irintensity: 0.2595 0.1327 0.2376 0.5198 0.4408 0.6027 0.0499 0.3137 0.6254 0.0544 0.0514 0.1836 0.0417 0.0688 0.7652 0.2463 0.0663 0.7849 4.8060 5.1590 3.2420 2.5574 4.0189 1.0117 0.1830 2.6746 0.9487 5.9797 2.7799 7.0772 11.6471 8.4288 11.7986 6.8488 6.6827 4.7654 11.0386 6.3524 9.8764 23.0099 19.2130 21.3926 10.4577 9.7208 0.9191 7.1779 3.7231 1.3995 2.5483 12.4191 12.9429 2.3080 10.2719 5.8948 13.4197 13.0754 4.2376 1.6305 4.3319 3.5689 1.3272 5.3339 3.5385 6.4075 7.5617 1.9608 2.4349 0.7779 8.8486 4.5121 10.3061 14.8072 0.1355 3.3367 1.1082 7.8553 5.2351 12.3240 12.8971 4.9734 15.4241 19.9065 8.2106 0.9204 1.7817 6.3005 24.2605 9.3409 7.3959 13.6447 9.6634 35.3405 55.1967 77.5726 76.9813 45.0764 177.1731 255.5432 47.7311 37.5518 4.8562 4.0253 11.1768 53.8747 55.4742 0.7484 41.2562 39.6353 19.1127 16.4001 70.3557 19.1939 51.2540 92.0671 50.7258 64.9281 28.2773 61.4887 37.8042 35.4295
temp: 298.150 k
press: 1.00000 atm
elementType: 7 7 6 6 6 6 6 6 6 6 6 6 6 6 1 1 1 1 1 1 1 1 1 1 1 1 1 1 1 1 1 1 1 1 1 1 1 1 1 1 1 1
symmnumber: 1
zpe: 1009024.2 jmol-1
zpe.correction: 0.384317 hartree
zpe.thermalcorrener: 0.403326 hartree
zpe.thermalcorrenthalpy: 0.404270 hartree
zpe.thermalcorrgfe: 0.337048 hartree
zpe.sumelectzpe: -582.323555 hartree
zpe.sumelectthermal: -582.304546 hartree
zpe.sumelectthermalent: -582.303602 hartree
zpe.sumelectthermalfe: -582.370824 hartree
dipole: 1.0139 0.2406 -0.6916
dipole: 1.2507
quadrupole: -89.8059 -92.0410 -91.1838
quadrupole: 1.3704 0.6096 2.4635
quadrupole: 1.2043 -1.0308 -0.1735 1.3704 0.6096 2.4635
hfenergy: -582.7078721 hartree
pointgroup: C01 [X(C12H28N2)]
dipole: -0.3772756 0.2058439 -0.2395949 debye
polarizability: 150.7742901|0.9567562|151.7058157|-1.878739|3.8466605|134.9608059 unknown
InChI: InChI=1S/C12H28N2/c1-7-9-12(14(5)6)11(8-2)10-13(3)4/h11-12H,7-10H2,1-6H3
charge 0 multiplicity 1
42 atoms
N  2.124624 0.421563 -0.427076
N  -2.249439 0.216683 -0.715396
C  -0.152388 0.978125 0.532613
C  0.717617 -0.078309 -0.222217
C  0.728218 -1.46182 0.502015
C  -1.640727 0.548858 0.598784
C  0.403435 1.297176 1.949303
C  0.345336 -2.652577 -0.408227
C  -0.145712 2.602152 2.568814
C  2.19506 1.765255 -1.046338
C  2.939767 -0.528337 -1.219728
C  0.356862 -4.003844 0.338138
C  -2.324835 1.371289 -1.632924
C  -3.565109 -0.435007 -0.551462
H  -0.116318 1.922497 -0.046419
H  0.232304 -0.2245 -1.222004
H  0.017484 -1.445533 1.35052
H  1.723509 -1.623985 0.959507
H  -2.221122 1.361934 1.109097
H  -1.733236 -0.3505 1.238469
H  1.505695 1.358414 1.868949
H  0.191482 0.449177 2.632035
H  1.035747 -2.702361 -1.27385
H  -0.661229 -2.460348 -0.829831
H  -1.238867 2.560243 2.729523
H  0.062822 3.470486 1.914013
H  0.32614 2.802766 3.548626
H  1.818102 2.5408 -0.35903
H  1.623846 1.840955 -2.008449
H  3.251913 2.003207 -1.262573
H  3.969175 -0.137376 -1.311772
H  2.537654 -0.695863 -2.252603
H  2.997942 -1.507223 -0.717701
H  -0.353012 -3.995373 1.187537
H  1.36131 -4.225016 0.747487
H  0.073079 -4.838342 -0.329656
H  -1.313047 1.742369 -1.871597
H  -2.917398 2.22582 -1.214834
H  -2.798826 1.057016 -2.580096
H  -3.959151 -0.734127 -1.539513
H  -4.329219 0.221496 -0.060224
H  -3.454993 -1.346039 0.063996
