program: Gaussian 09
title: 000264887
version: EM64L-G09RevD.01
frameworkgroup: C1[X(C11H11ClN4O2S)]
method: RPBEPBE
basis: SDD
operation: Freq
keyword: #p
keyword: freq=noraman
keyword: PBEPBE/SDD
title: #p freq=noraman PBEPBE/SDD
converged: YES YES NO NO
title: Mulliken charges:
elementType: Cl S O O N N N N C C C C C C C C C C C H H H H H H H H H H H
charge: 0.027984 0.298507 -0.221242 -0.433765 -0.188299 -0.021959 0.043629 0.124372 -0.115457 -0.116594 -0.371714 -0.176199 0.217694 -0.143360 -0.210488 0.083699 -0.322555 -0.433557 -0.832717 0.234983 0.192211 0.233103 0.234810 0.244786 0.242740 0.273313 0.340588 0.283495 0.260540 0.251454
chargesum: 0.00000
title: Mulliken charges with hydrogens summed into heavy atoms:
elementType: Cl S O O N N N N C C C C C C C C C C C
charge: 0.027984 0.298507 -0.221242 -0.093177 -0.188299 -0.021959 0.043629 0.124372 0.119526 0.075617 0.096198 0.068587 0.217694 0.099380 0.062825 0.083699 -0.322555 -0.433557 -0.037228
polarizability: 2.29019099e+02 -1.75579465e+01 2.16956751e+02 4.48724993e-01 -4.03124518e+00 9.94563841e+01
1716.lowfreq: -5.5662 -4.9390 0.0005 0.0018 0.0023 6.6348 23.0572 39.5554 59.7119
frequency: 22.9499 39.5406 59.6718 69.7537 90.6140 103.7220 122.4817 136.3156 145.1917 160.2435 193.7546 217.2311 243.0923 254.4891 278.4456 318.7063 344.2104 374.6055 389.8311 397.5585 420.5594 477.3944 501.0264 541.5911 580.3881 600.0178 634.7588 648.0343 667.4836 674.3173 715.5521 745.3367 782.0653 787.9731 799.1940 802.7922 822.6184 835.8119 900.0886 909.3504 937.9426 954.3454 980.2054 990.2863 993.8240 1039.7969 1056.7943 1074.2261 1085.3405 1146.6832 1170.5794 1180.0968 1197.1332 1203.7345 1246.1351 1274.1227 1296.1520 1305.9046 1309.4857 1316.5793 1339.2405 1347.7607 1355.8512 1360.9227 1395.2507 1400.1078 1435.2702 1445.1079 1448.4421 1454.2897 1491.7969 1565.4279 1685.3420 2923.8417 2991.2530 3017.8646 3021.5346 3084.3014 3130.5947 3139.9400 3148.2573 3162.3223 3227.7017 3542.9372
redmass: 5.6597 5.8320 5.1915 4.0084 4.6346 3.7293 1.4888 5.0247 3.7134 10.3899 4.9751 5.2847 2.3824 1.8441 6.8320 6.3069 5.6166 3.3753 4.4376 4.7914 6.2439 5.1857 6.5757 6.4050 9.5251 9.3388 5.5852 4.6543 7.5488 11.9190 2.3422 9.5771 5.0799 5.9673 3.5647 6.0289 4.0443 1.6260 6.1089 2.9395 3.0851 3.5993 1.1826 1.3975 1.2962 4.0702 2.2084 3.6962 2.7090 5.6397 2.3381 1.1127 1.2043 6.8511 1.1402 2.8374 5.7081 2.0828 1.6217 2.2123 1.5294 1.2108 1.4986 1.3353 4.1080 1.7507 1.0556 3.4898 1.0847 1.0939 8.3008 10.3701 7.3819 1.0817 1.0642 1.0280 1.0845 1.1016 1.0861 1.1048 1.1048 1.1002 1.0985 1.0663
irintensity: 0.2041 1.7888 2.1216 1.3486 0.8614 0.2449 0.6360 0.5632 1.5768 0.6811 11.8281 1.2637 59.8191 89.4289 14.6453 2.2078 0.7643 0.4027 3.0946 3.6848 7.7054 1.9557 9.7115 16.4526 2.0731 15.2580 5.1937 17.2720 1.4785 0.3628 14.9431 28.0133 14.0628 7.0384 7.4416 163.3894 65.4658 13.2702 99.9791 24.4334 23.1651 24.2489 9.7294 3.3413 7.8730 167.9773 19.7091 102.5741 33.1530 86.0812 105.8858 27.9691 32.2929 51.2461 5.5134 27.4498 39.7934 102.7092 39.9193 54.0605 52.9816 23.3323 24.5852 1.8141 72.7146 5.8103 19.0032 104.7275 7.5988 69.4231 192.0006 177.1365 0.2849 43.1043 32.6536 20.2864 11.5907 18.7560 2.3778 16.0963 9.9079 13.8541 0.5134 5.1564
temp: 298.150 k
press: 1.00000 atm
elementType: 17 16 8 8 7 7 7 7 6 6 6 6 6 6 6 6 6 6 6 1 1 1 1 1 1 1 1 1 1 1
symmnumber: 1
zpe: 560351.7 jmol-1
zpe.correction: 0.213427 hartree
zpe.thermalcorrener: 0.231144 hartree
zpe.thermalcorrenthalpy: 0.232089 hartree
zpe.thermalcorrgfe: 0.165988 hartree
zpe.sumelectzpe: -1651.905527 hartree
zpe.sumelectthermal: -1651.887809 hartree
zpe.sumelectthermalent: -1651.886865 hartree
zpe.sumelectthermalfe: -1651.952965 hartree
dipole: -6.1131 1.4078 0.3342
dipole: 6.2820
quadrupole: -142.3042 -120.8614 -119.3249
quadrupole: -9.1717 5.5637 -4.9722
quadrupole: -14.8073 6.6354 8.1719 -9.1717 5.5637 -4.9722
hfenergy: -1652.1189534 hartree
pointgroup: C01 [X(C11H11Cl1N4O2S1)]
dipole: -2.3363895 -0.7305924 -0.3404613 debye
polarizability: 225.3941096|18.4550148|219.69508|10.9185606|-1.4585951|100.3430448 unknown
InChI: InChI=1S/C11H11ClN4O2S/c1-19-11-14-9(12)8-10(15-11)16(5-13-8)7-3-2-6(17)4-18-7/h2-3,5-7,17H,4H2,1H3
charge 0 multiplicity 1
30 atoms
Cl 4.787312 1.010583 0.591874
S  1.645084 -3.293662 0.073533
O  -2.354261 1.272442 0.781741
O  -4.846876 -0.476996 -0.135238
N  -0.159109 1.615532 -0.236251
N  1.886741 2.627275 0.108299
N  0.560358 -0.764774 -0.091895
N  2.967298 -0.973652 0.288116
C  -1.638101 1.547422 -0.448365
C  -3.41115 -0.821663 -0.114529
C  -2.616085 -0.161946 1.027244
C  -2.006927 0.631328 -1.599411
C  0.765894 0.577408 -0.080274
C  -2.859906 -0.40973 -1.460609
C  0.576192 2.812495 -0.100638
C  2.032481 1.230678 0.125252
C  3.12593 0.353472 0.310941
C  1.704467 -1.48226 0.088386
C  -0.18995 -3.573069 -0.220038
H  -1.929349 2.584664 -0.70079
H  -3.29368 -1.924265 0.00112
H  -3.180728 -0.171635 1.974347
H  -1.656939 -0.701491 1.155875
H  -1.588757 0.901832 -2.576035
H  -3.185975 -0.987749 -2.331738
H  0.091445 3.785255 -0.165855
H  -5.280326 -0.841424 0.679451
H  -0.512007 -3.017193 -1.111869
H  -0.764462 -3.24474 0.658388
H  -0.299713 -4.658139 -0.371738
