program: Gaussian 09
title: 000264904
version: EM64L-G09RevD.01
frameworkgroup: C1[X(C18H22O2)]
method: RPBEPBE
basis: SDD
operation: Freq
keyword: #pfreq=noraman
keyword: PBEPBE/SDD
title: #p freq=noraman PBEPBE/SDD
converged: YES YES NO NO
title: Mulliken charges:
elementType: O O C C C C C C C C C C C C C C C C C C H H H H H H H H H H H H H H H H H H H H H H
charge: -0.465586 -0.269441 0.394939 -0.271131 -0.157852 -0.465698 -0.529971 0.158851 -0.556097 -0.527095 0.158547 -0.809978 -0.699324 0.167906 0.297092 -0.411691 -0.585781 -0.370667 0.325541 -0.536159 0.244638 0.217929 0.219390 0.227934 0.208680 0.221035 0.229064 0.218785 0.230969 0.215053 0.203760 0.260450 0.226541 0.238676 0.240932 0.332688 0.240606 0.252008 0.245450 0.218436 0.242838 0.217735
chargesum: 0.00000
title: Mulliken charges with hydrogens summed into heavy atoms:
elementType: O O C C C C C C C C C C C C C C C C C C
charge: -0.132897 -0.269441 0.394939 -0.026493 0.060078 -0.018373 -0.100256 0.158851 -0.108249 -0.081073 0.158547 -0.119228 -0.219716 0.167906 0.297092 -0.171086 -0.333773 -0.125218 0.325541 0.142850
polarizability: 2.89156182e+02 5.54649027e+00 1.88612404e+02 1.71974351e+00 -6.81015229e+00 1.29366487e+02
1716.lowfreq: -10.7077 -3.8043 -0.0006 -0.0003 0.0002 8.5193 30.8923 66.9032 69.7228
frequency: 30.8729 66.8837 69.7198 99.5983 115.1798 129.8556 151.4259 183.1362 199.9620 212.4236 224.4847 236.0426 252.9444 266.5435 285.4622 301.3193 329.1789 361.2300 370.6975 409.5992 420.4635 428.5899 454.0396 472.1096 502.9635 513.7609 549.9735 569.3727 590.1775 604.3464 642.9650 690.0883 713.0679 735.3194 744.8174 766.6329 793.7701 824.8031 842.6471 853.7035 869.4232 883.3274 902.2641 916.9394 922.6646 948.6768 953.4593 961.0075 981.6260 995.6775 1005.2840 1021.9345 1039.1748 1049.3408 1087.4851 1093.7247 1105.4766 1112.8034 1114.7875 1118.3282 1140.6349 1148.8107 1151.6172 1157.9090 1180.4982 1190.5431 1198.6722 1213.1271 1216.2119 1247.4625 1255.6667 1270.7294 1281.4319 1284.4494 1295.4878 1299.3374 1314.9897 1331.9135 1345.7250 1363.6893 1381.7109 1387.8364 1391.4248 1417.8211 1427.0043 1452.1115 1456.6537 1464.3581 1465.3458 1466.4259 1471.9126 1477.0917 1479.3228 1480.7004 1487.0367 1587.4841 1620.9830 1634.5722 2952.3349 2954.7573 2962.3984 2965.2670 2971.4248 2977.9853 2981.2493 2994.9716 3005.6846 3007.3006 3011.5351 3036.9679 3037.0908 3042.7682 3066.8359 3072.3854 3101.9590 3119.0946 3130.3342 3145.1877 3165.6299 3565.8370
redmass: 3.8580 2.9462 3.4404 4.7983 3.2119 3.4254 3.2650 1.6435 2.6571 1.7803 1.4877 3.2979 2.1522 1.8679 1.1603 2.4413 2.8287 3.7255 3.3556 3.0820 3.3930 2.8617 3.7537 3.7410 3.8121 3.1170 4.0164 3.2675 4.3377 3.1038 3.6295 3.6412 2.9024 4.1837 4.2364 2.4315 2.1637 1.4160 1.5119 2.6892 2.2312 2.6187 3.6057 1.8736 2.1760 1.4366 2.6570 2.4783 2.1966 4.0688 1.9602 2.2953 2.3772 3.2138 2.2177 1.6786 1.2089 1.2761 1.6653 1.5492 1.4040 1.5028 1.4673 1.5645 1.4649 1.9254 1.3195 2.3510 1.4868 2.2242 1.5307 1.3887 1.4232 1.5572 1.5956 1.7549 1.3926 1.4127 1.7643 1.5718 5.3726 1.2938 2.9736 1.2006 1.5779 2.1114 1.0982 1.0915 1.0511 1.0797 1.3188 1.0752 1.0882 1.9565 1.0622 7.8238 7.2576 7.9191 1.0333 1.0833 1.0608 1.0620 1.0811 1.0539 1.0461 1.0608 1.0955 1.0971 1.0644 1.1035 1.1026 1.1022 1.0977 1.1046 1.0979 1.0988 1.0892 1.0908 1.0951 1.0661
irintensity: 0.4007 1.9070 1.5472 1.4361 1.6383 1.9974 1.5876 0.6880 0.7331 1.8463 0.0529 2.9212 7.1528 3.9705 137.6177 9.5663 3.8979 4.4458 4.5583 5.6897 6.6511 2.3131 9.2507 3.7690 1.6166 2.0094 3.8649 1.5069 1.1350 4.6664 5.4330 2.3586 1.6058 0.3503 2.0471 12.3552 4.6449 35.7675 29.0493 15.0522 2.9950 0.1969 16.3436 18.5644 13.2657 5.2099 30.2920 5.2063 12.4975 47.2943 1.1655 2.9586 13.8527 1.4847 5.2910 45.4714 4.3524 0.6923 12.4070 9.5074 20.3733 8.3620 25.5913 36.8094 3.7596 5.0014 13.7793 33.9586 6.5258 94.8918 0.9554 19.2661 11.2581 17.9510 13.3473 9.3151 2.3143 4.4369 1.5742 2.6373 7.5174 26.4221 19.9568 18.4096 28.9898 6.7862 4.4611 16.4091 13.4582 2.4722 115.9316 7.1779 8.3143 20.6416 8.6568 11.4432 45.0923 19.6093 76.8785 43.7244 23.2131 15.4780 27.6230 27.0994 44.3219 68.5180 32.1797 2.4117 49.6346 35.6048 65.9907 12.5216 41.9255 58.5416 12.0121 31.6765 14.5370 11.6502 12.3985 2.3968
temp: 298.150 k
press: 1.00000 atm
elementType: 8 8 6 6 6 6 6 6 6 6 6 6 6 6 6 6 6 6 6 6 1 1 1 1 1 1 1 1 1 1 1 1 1 1 1 1 1 1 1 1 1 1
symmnumber: 1
zpe: 931898.6 jmol-1
zpe.correction: 0.354941 hartree
zpe.thermalcorrener: 0.373187 hartree
zpe.thermalcorrenthalpy: 0.374131 hartree
zpe.thermalcorrgfe: 0.309627 hartree
zpe.sumelectzpe: -848.064297 hartree
zpe.sumelectthermal: -848.046051 hartree
zpe.sumelectthermalent: -848.045107 hartree
zpe.sumelectthermalfe: -848.109611 hartree
dipole: -1.5115 -2.1462 -1.2554
dipole: 2.9097
quadrupole: -107.9682 -108.7506 -123.7066
quadrupole: -8.3142 9.7309 -1.6502
quadrupole: 5.5070 4.7245 -10.2315 -8.3142 9.7309 -1.6502
hfenergy: -848.419238 hartree
pointgroup: C01 [X(C18H22O2)]
dipole: 0.6038885 -0.8346761 0.4991475 debye
polarizability: 289.2707632|-4.2137589|188.5252875|2.3092091|6.6221402|129.3390228 unknown
InChI: InChI=1S/C18H22O2/c1-18-8-7-14-13-4-3-12(20-2)9-11(13)10-15(14)16(18)5-6-17(18)19/h3-4,9,16-17,19H,5-8,10H2,1-2H3
charge 0 multiplicity 1
42 atoms
O  4.991155 -0.816498 -0.902709
O  -5.479714 -0.167209 -0.031018
C  2.986472 0.453371 -0.318498
C  2.089702 -0.835548 -0.226353
C  4.358216 -0.060284 0.201808
C  2.651176 -1.669371 0.988332
C  2.448641 1.549197 0.654835
C  0.625313 -0.496444 -0.132802
C  4.008138 -1.004538 1.377388
C  0.995298 1.977042 0.330039
C  0.125254 0.763094 0.109381
C  3.061738 1.005264 -1.759409
C  -0.516968 -1.491923 -0.312779
C  -1.349259 0.715971 0.107957
C  -1.760338 -0.627824 -0.140829
C  -2.322474 1.724128 0.303423
C  -3.118955 -0.981809 -0.196804
C  -3.68955 1.381897 0.24874
C  -4.086156 0.042113 0.000595
C  -5.951973 -1.526056 -0.29145
H  2.274543 -1.423505 -1.148602
H  5.026921 0.771955 0.510331
H  2.790499 -2.725073 0.696862
H  1.943394 -1.6510 1.836572
H  3.117141 2.432105 0.616304
H  2.469672 1.169199 1.694725
H  3.903511 -0.419321 2.30974
H  4.808233 -1.747785 1.557043
H  0.974964 2.626536 -0.569517
H  0.595599 2.595189 1.158804
H  3.623922 1.958176 -1.793345
H  3.573283 0.285873 -2.418835
H  2.048955 1.191683 -2.159729
H  -0.474329 -2.311779 0.433753
H  -0.483023 -1.977396 -1.309767
H  5.791329 -1.278248 -0.546763
H  -2.029975 2.762809 0.49459
H  -3.41748 -2.017347 -0.389035
H  -4.472733 2.132435 0.393802
H  -5.617841 -1.888443 -1.284007
H  -7.049976 -1.458543 -0.273876
H  -5.610624 -2.231789 0.491807
