program: Gaussian 09
title: 000264900
version: EM64L-G09RevD.01
frameworkgroup: C1[X(C19H25NO2)]
method: RPBEPBE
basis: SDD
operation: Freq
keyword: #p
keyword: freq=noraman
keyword: PBEPBE/SDD
title: #p freq=noraman PBEPBE/SDD
converged: YES YES NO NO
title: Mulliken charges:
elementType: O O N C C C C C C C C C C C C C C C C C C C H H H H H H H H H H H H H H H H H H H H H H H H H
charge: -0.265364 -0.272751 -0.187159 -0.191742 -0.404345 0.451561 -0.406531 0.422266 -0.733650 -0.352403 -0.424919 -0.678944 -0.370327 -0.305187 -0.371424 -0.384009 0.318018 -0.383270 -0.407339 0.315114 -0.537534 -0.536813 0.199363 0.217146 0.237017 0.221627 0.220417 0.228915 0.211974 0.222730 0.254029 0.236004 0.217720 0.239608 0.212804 0.227432 0.247190 0.248312 0.236690 0.241844 0.232939 0.219133 0.219414 0.244773 0.216465 0.214163 0.239040
chargesum: 0.00000
title: Mulliken charges with hydrogens summed into heavy atoms:
elementType: O O N C C C C C C C C C C C C C C C C C C C
charge: -0.265364 -0.272751 -0.187159 0.007622 0.049818 0.451561 0.035513 0.422266 -0.070030 -0.098374 -0.188915 -0.008813 -0.142895 -0.057997 -0.123111 -0.147319 0.318018 -0.141425 -0.174400 0.315114 0.145786 0.132855
polarizability: 2.61969510e+02 5.48432763e+00 2.38425608e+02 -1.33868154e+01 -1.01143397e+01 1.79368161e+02
1716.lowfreq: -13.4452 -7.7798 -6.7915 0.0004 0.0007 0.0010 5.0970 20.7840 43.3985
frequency: -11.6544 20.3412 43.2890 48.5780 57.2436 81.9555 88.8460 98.1170 112.9537 131.5991 138.8852 164.6426 184.6627 198.4217 203.4395 219.2650 224.7031 239.1092 268.4784 286.0287 305.5488 331.0739 339.0874 356.9184 369.0189 416.1728 419.0660 436.6764 463.0026 478.2855 492.2015 515.2355 532.3768 540.2068 591.9311 630.6797 636.7638 674.2745 694.4017 714.5212 733.1836 777.2778 782.4842 786.0863 794.2898 807.3301 809.1216 825.5319 849.9018 905.4435 913.8429 917.0659 933.3260 939.4397 972.9449 986.6436 988.3939 990.1172 1001.8488 1005.8586 1043.7354 1064.2206 1085.6745 1087.6555 1111.8864 1113.8370 1117.0693 1123.7074 1134.1495 1154.7563 1159.2188 1178.9347 1183.8127 1188.8750 1194.7540 1229.0428 1229.6189 1237.4501 1260.5938 1290.7508 1300.5618 1301.7724 1318.4609 1327.5548 1343.2912 1368.4897 1370.5975 1379.6772 1393.1293 1408.1847 1415.6107 1431.3511 1434.4110 1438.9624 1463.6234 1464.3185 1464.4000 1471.9205 1474.8175 1475.1512 1477.8623 1480.8762 1489.3205 1495.4988 1498.3846 1511.1541 1572.7575 1581.7680 1621.9854 1635.5627 2946.7583 2956.0183 2958.1632 2972.8760 2977.4413 2983.6975 3004.6247 3028.8136 3032.7575 3042.3210 3046.7431 3070.2715 3072.1018 3076.2754 3087.2598 3115.1294 3122.5070 3138.0674 3138.9791 3144.0958 3145.4431 3160.3147 3166.0092 3166.1316 3176.1522
redmass: 3.1710 4.8163 3.0958 3.6098 3.3344 3.3565 3.0558 3.4500 3.3039 4.2049 4.0357 1.9486 3.0354 1.0673 1.6240 1.8705 1.7006 1.2133 2.3785 2.7104 3.6918 3.7208 3.6539 3.4777 3.9784 2.9917 3.1038 4.0166 4.0074 3.4846 3.5991 2.7383 2.7124 3.4802 4.0609 7.0033 6.5593 3.7530 2.4745 3.6548 2.5033 2.5501 3.8934 1.2195 1.3303 1.6880 1.5830 1.5390 1.7646 2.2282 2.0942 1.4109 1.3385 1.3898 1.3544 4.6632 5.7432 4.5886 2.7903 3.1417 2.1554 2.3022 1.9502 1.8528 1.2606 1.2606 1.4356 1.4384 2.1315 1.3330 1.4028 1.3599 1.8605 1.6620 2.2524 3.0985 2.0827 1.2925 1.8438 1.2426 1.2832 1.3076 1.3589 1.4708 1.2789 5.1260 5.1425 1.2317 1.2285 1.6232 3.6132 2.7204 1.1668 1.2977 1.0504 1.0473 1.0505 1.0817 1.0713 1.0673 1.0450 1.0548 1.0739 1.1214 2.2604 2.4476 7.1079 7.2528 6.3359 6.4478 1.0334 1.0333 1.0820 1.0361 1.0358 1.0609 1.0617 1.1033 1.1014 1.1037 1.0993 1.1001 1.0995 1.1005 1.1007 1.0984 1.0990 1.0869 1.0877 1.0868 1.0881 1.0948 1.0960 1.0957 1.0938
irintensity: 0.3579 0.0935 0.9058 0.5540 2.7004 3.4100 1.1306 2.2480 0.2622 1.4916 2.2323 1.4888 3.6547 0.1975 0.6680 1.0904 1.5920 0.1838 0.6022 2.8448 2.9917 2.1172 2.0418 1.6455 0.4259 0.7155 0.3936 1.2836 9.0237 9.6184 8.8660 23.8221 5.9765 10.2237 8.6455 0.4387 1.1103 10.6041 16.4860 0.3492 7.6784 3.5657 31.9957 18.6034 1.2946 40.6330 61.0561 11.4529 44.4175 14.1786 10.6323 2.0665 1.0239 0.7901 0.7621 18.5098 11.7224 42.9268 13.6756 60.0432 8.6906 7.8181 10.8999 19.7352 0.1248 0.2192 18.1785 3.8840 15.8475 2.5587 3.2773 117.8086 15.7521 80.0712 2.5081 163.9435 229.3864 3.3669 28.9999 5.4776 27.4374 1.0058 10.2873 16.1548 33.0477 7.5301 19.2471 28.7876 24.6266 5.2317 5.0314 21.5316 8.9372 12.1088 12.1750 9.7922 14.4437 63.1762 19.7866 58.7382 8.9538 1.3973 9.3552 15.6583 123.1832 394.9277 1.5269 11.7291 46.0136 14.7706 79.5862 73.8998 12.5772 43.8286 27.2019 50.1677 21.4677 56.8367 15.2167 50.0135 0.8596 78.3273 27.6859 57.5109 42.5949 34.3038 29.2149 9.4962 8.4696 19.5978 9.6321 20.3940 9.7260 15.2857 4.8924
temp: 298.150 k
press: 1.00000 atm
elementType: 8 8 7 6 6 6 6 6 6 6 6 6 6 6 6 6 6 6 6 6 6 6 1 1 1 1 1 1 1 1 1 1 1 1 1 1 1 1 1 1 1 1 1 1 1 1 1
symmnumber: 1
zpe: 1039544.6 jmol-1
zpe.correction: 0.395942 hartree
zpe.thermalcorrener: 0.417923 hartree
zpe.thermalcorrenthalpy: 0.418867 hartree
zpe.thermalcorrgfe: 0.344530 hartree
zpe.sumelectzpe: -942.523200 hartree
zpe.sumelectthermal: -942.501219 hartree
zpe.sumelectthermalent: -942.500275 hartree
zpe.sumelectthermalfe: -942.574612 hartree
dipole: -2.6423 0.7226 2.2176
dipole: 3.5244
quadrupole: -131.2041 -118.0564 -128.1802
quadrupole: 6.5938 -7.6810 -10.2071
quadrupole: -5.3905 7.7572 -2.3667 6.5938 -7.6810 -10.2071
hfenergy: -942.9191417 hartree
pointgroup: C01 [X(C19H25N1O2)]
dipole: 0.992851 0.1088237 -0.9618247 debye
polarizability: 259.6085592|-8.1905316|240.7855431|-17.010275|2.2857198|179.3691758 unknown
InChI: InChI=1S/C19H25NO2/c1-5-19(15-7-11-17(21-3)12-8-15)20(6-2)16-9-13-18(22-4)14-10-16/h7-14,19H,5-6H2,1-4H3
charge 0 multiplicity 1
47 atoms
O  4.608333 -2.061407 1.064864
O  -4.564907 -2.522717 0.597108
N  -0.685775 1.654727 0.498802
C  0.454874 1.689994 -0.458116
C  0.010589 1.7185 -1.959016
C  1.543497 0.643871 -0.121195
C  -0.954984 2.897906 1.245991
C  -1.640668 0.609897 0.483561
C  0.869885 2.671218 -2.821962
C  1.790246 0.308352 1.238028
C  2.362051 0.043199 -1.105404
C  -1.808984 3.944882 0.484998
C  -2.896439 0.733101 1.161254
C  -1.391264 -0.624989 -0.184859
C  2.808609 -0.58816 1.599874
C  3.392971 -0.864592 -0.762762
C  3.619249 -1.179191 0.597891
C  -3.82776 -0.319888 1.180555
C  -2.328167 -1.68033 -0.172503
C  -3.555927 -1.536745 0.514764
C  5.459851 -2.708172 0.065489
C  -4.296675 -3.797353 -0.063064
H  0.924435 2.679176 -0.272953
H  0.017355 0.702182 -2.39383
H  -1.041636 2.055453 -1.989174
H  -1.441828 2.643506 2.206097
H  0.01866 3.353193 1.510566
H  1.942114 2.404029 -2.797277
H  0.781916 3.714398 -2.46237
H  0.542219 2.654421 -3.877726
H  1.147007 0.740617 2.012218
H  2.20568 0.268259 -2.16543
H  -1.295803 4.275947 -0.436412
H  -2.789103 3.526461 0.196359
H  -1.984221 4.836153 1.11679
H  -3.164876 1.659782 1.67603
H  -0.439404 -0.787154 -0.695337
H  2.991153 -0.853766 2.645759
H  4.001067 -1.310028 -1.556141
H  -4.782367 -0.209472 1.705011
H  -2.077124 -2.608516 -0.695794
H  6.04113 -1.963735 -0.513554
H  4.864344 -3.33298 -0.628936
H  6.146185 -3.346351 0.641355
H  -3.400383 -4.29366 0.360483
H  -4.160779 -3.66947 -1.156088
H  -5.186144 -4.416848 0.127257
