program: Gaussian 09
title: 000264901
version: EM64L-G09RevD.01
frameworkgroup: C1[X(C18H20O3)]
method: RPBEPBE
basis: SDD
operation: Freq
keyword: #pfreq=noraman
keyword: PBEPBE/SDD
title: #p freq=noraman PBEPBE/SDD
converged: YES YES NO NO
title: Mulliken charges:
elementType: O O O C C C C C C C C C C C C C C C C C C H H H H H H H H H H H H H H H H H H H H
charge: -0.181743 -0.201829 -0.265033 0.133274 -0.507639 0.096903 0.136143 -0.514084 -0.516205 -0.727701 0.343955 -0.390172 -0.601663 -0.573130 0.107839 0.314425 -0.364180 -0.560756 0.328541 -0.368496 -0.536192 0.236965 0.240039 0.262119 0.252243 0.261928 0.263352 0.242873 0.221653 0.241241 0.231023 0.265252 0.234914 0.227029 0.238023 0.238196 0.252356 0.249968 0.221741 0.221153 0.245676
chargesum: 0.00000
title: Mulliken charges with hydrogens summed into heavy atoms:
elementType: O O O C C C C C C C C C C C C C C C C C C
charge: -0.181743 -0.201829 -0.265033 0.133274 -0.030636 0.096903 0.136143 0.000278 0.009076 -0.021934 0.343955 -0.159149 -0.101496 -0.108079 0.107839 0.314425 -0.125984 -0.308400 0.328541 -0.118529 0.152378
polarizability: 2.94443640e+02 2.27614375e+00 1.90005853e+02 -2.76325628e+01 5.91047941e+00 1.41220450e+02
1716.lowfreq: -12.0171 -0.0005 -0.0003 0.0001 1.0886 5.7163 21.1161 26.3629 32.7041
frequency: 20.8700 26.2077 32.6272 36.8145 64.4340 87.1210 90.0040 107.7641 122.5539 170.6824 178.5288 185.7802 193.0436 204.2279 229.4568 239.8046 259.7913 285.9279 310.4537 374.8840 390.3548 429.5757 433.4942 469.0647 483.9475 505.3312 531.6342 543.2941 550.6421 563.6406 574.2723 576.3493 634.6427 646.6694 660.3053 706.3517 733.1989 737.7448 787.9507 796.7568 815.4743 831.9753 856.7007 861.0864 897.4013 909.8156 921.4993 958.6189 970.3138 981.5326 995.7585 1001.8435 1008.7862 1017.6845 1025.3378 1054.9398 1066.6937 1093.5795 1094.1199 1111.5453 1147.0051 1150.3727 1153.0525 1157.0563 1159.4084 1176.9360 1194.7429 1216.5506 1222.7937 1251.1735 1251.4301 1254.6634 1276.3302 1282.6555 1295.5808 1296.6888 1312.4328 1338.6445 1377.4827 1387.5999 1425.6330 1427.6738 1436.6125 1444.8505 1446.7928 1454.3897 1465.7319 1465.9051 1471.3349 1472.5954 1473.5653 1485.7057 1588.7119 1615.2100 1632.7260 1672.2866 1677.0376 2958.4661 2982.0404 2984.5160 2985.6539 2991.9017 2996.5583 2999.6949 3037.5076 3045.8172 3053.6130 3063.5617 3071.2821 3081.9354 3084.1272 3085.9081 3099.0419 3124.1677 3131.9437 3147.7381 3167.6997
redmass: 4.4882 4.0972 4.7678 4.3186 4.9078 2.1327 2.1985 5.1003 3.6880 3.2318 2.2332 3.7305 1.1685 3.2688 2.1805 1.7017 2.5212 2.8863 4.3100 6.0108 4.0057 2.7884 4.9554 3.7109 2.9815 4.2409 2.4092 3.4094 3.8929 4.1757 3.6521 2.7359 4.7053 4.4787 4.1540 3.1530 4.0264 4.4872 2.0082 2.1673 1.3551 1.5329 1.7762 1.4547 4.1136 2.2008 1.7345 1.3645 3.5697 2.8780 3.9435 2.2942 2.9036 1.9583 2.4584 2.1788 2.2477 2.3322 2.5651 1.2606 1.8884 1.2312 1.3069 1.8541 1.7483 2.4608 1.6261 1.3121 1.2915 1.5705 1.4672 2.0655 1.3608 1.5144 2.2289 1.4645 1.9861 1.5609 1.2227 5.8924 1.0747 1.6562 1.0910 1.2485 1.6359 1.1774 1.0520 1.0615 1.1016 1.1468 1.0534 2.1734 7.9453 6.8006 11.9133 8.3235 11.4987 1.0330 1.0603 1.0604 1.0344 1.0681 1.0621 1.0684 1.0978 1.1038 1.0996 1.0992 1.0954 1.0981 1.0984 1.0918 1.1016 1.0993 1.0891 1.0910 1.0954
irintensity: 4.5312 0.8333 12.9341 0.2088 1.5461 1.9160 1.0999 0.7860 4.7622 0.9894 0.2013 2.1404 1.2705 2.4101 0.3321 1.7904 1.6697 4.1903 7.8446 8.6139 0.8645 4.4869 13.9047 3.4069 2.3424 2.6016 3.7671 3.2416 2.5238 3.3047 3.9706 0.3012 2.5770 2.1210 7.0931 5.8285 7.4965 2.1313 10.8567 8.9819 5.6835 50.2015 13.9797 17.3400 8.1802 23.5469 0.0482 0.2904 4.4262 24.0443 44.0163 22.7987 0.7489 1.9950 4.0383 23.4815 18.3310 26.4029 18.4057 0.2003 7.1148 3.5894 8.8684 2.1316 42.2986 68.1864 39.0045 27.6744 28.6671 16.3763 0.8317 118.9485 6.1759 0.7492 75.3949 1.5476 16.5397 1.6278 20.1555 9.8604 3.6521 14.9813 38.3097 10.1390 2.1165 3.5050 11.2201 29.4965 14.6144 89.7366 7.3304 48.1528 9.6790 137.9034 244.0914 15.2665 22.0183 77.5002 20.4507 30.0165 31.8690 25.4486 16.1952 0.5620 17.3944 49.2525 4.1916 13.6428 4.5252 3.6773 30.2580 21.2983 10.1238 28.5173 10.2431 13.5012 8.9206
temp: 298.150 k
press: 1.00000 atm
elementType: 8 8 8 6 6 6 6 6 6 6 6 6 6 6 6 6 6 6 6 6 6 1 1 1 1 1 1 1 1 1 1 1 1 1 1 1 1 1 1 1 1
symmnumber: 1
zpe: 873892.6 jmol-1
zpe.correction: 0.332848 hartree
zpe.thermalcorrener: 0.353323 hartree
zpe.thermalcorrenthalpy: 0.354268 hartree
zpe.thermalcorrgfe: 0.281475 hartree
zpe.sumelectzpe: -922.029169 hartree
zpe.sumelectthermal: -922.008694 hartree
zpe.sumelectthermalent: -922.007750 hartree
zpe.sumelectthermalfe: -922.080543 hartree
dipole: -1.7472 1.3347 1.8567
dipole: 2.8778
quadrupole: -108.0932 -128.2009 -125.1672
quadrupole: -6.5600 1.0212 -8.9802
quadrupole: 12.3939 -7.7138 -4.6801 -6.5600 1.0212 -8.9802
hfenergy: -922.3620175 hartree
pointgroup: C01 [X(C18H20O3)]
dipole: 0.6838653 0.4590497 -0.776838 debye
polarizability: 293.9779164|-5.1592389|188.7327917|-28.528263|-9.7071944|142.9592354 unknown
InChI: InChI=1S/C18H20O3/c1-18(16(19)7-8-17(18)20)10-9-12-3-4-13-11-14(21-2)5-6-15(12)13/h5-6,9,11H,3-4,7-8,10H2,1-2H3
charge 0 multiplicity 1
41 atoms
O  -4.003354 -1.98669 1.16878
O  -2.67679 1.753649 -1.568912
O  5.457943 -1.121676 -0.223603
C  -3.428882 0.237301 0.240255
C  -2.358249 0.616968 1.330372
C  -3.654225 -1.285741 0.189514
C  -2.902012 0.587678 -1.164339
C  -3.402799 -1.82056 -1.231235
C  -2.670139 -0.688698 -1.98623
C  -4.763455 0.974445 0.54042
C  0.129531 0.629949 0.729666
C  -1.002949 -0.025449 1.122838
C  0.253363 2.133323 0.429206
C  1.668441 2.32577 -0.208923
C  1.465017 0.028655 0.530266
C  2.369498 0.992336 0.012786
C  1.916207 -1.294009 0.780458
C  3.713581 0.665791 -0.259844
C  4.150368 -0.659186 -0.003765
C  3.252904 -1.63435 0.513941
C  6.435338 -0.16646 -0.748947
H  -2.785597 0.299423 2.302484
H  -2.277812 1.71915 1.334955
H  -2.849661 -2.773957 -1.185736
H  -4.386582 -2.047449 -1.688105
H  -2.992221 -0.54404 -3.031183
H  -1.576076 -0.862705 -2.006016
H  -4.597245 2.064884 0.493833
H  -5.552326 0.716248 -0.189147
H  -5.120371 0.69791 1.547773
H  -0.947921 -1.10625 1.322195
H  -0.55263 2.491145 -0.234047
H  0.176991 2.707616 1.372927
H  2.220521 3.170027 0.243689
H  1.585548 2.543558 -1.291606
H  1.237808 -2.051108 1.189659
H  4.394676 1.423429 -0.660126
H  3.637029 -2.64183 0.700475
H  6.577738 0.686172 -0.056475
H  6.133732 0.212134 -1.745191
H  7.37366 -0.733501 -0.836663
